JustPaste.it

supernova@supernova-BOHB-WAX9:~/tmp$ cd ~/dev/qt-build
/~tmp/qt-everywhere-src-6.4.2/configure
bash: /~tmp/qt-everywhere-src-6.4.2/configure: No such file or directory
supernova@supernova-BOHB-WAX9:~/dev/qt-build$ /~tmp/qt-everywhere-src-6.4.2/configure^C
supernova@supernova-BOHB-WAX9:~/dev/qt-build$ cd ~/dev/qt-build
~/tmp/qt-everywhere-src-6.4.2/configure
+ mkdir -p qtbase
+ cd qtbase
+ exec /home/supernova/tmp/qt-everywhere-src-6.4.2/qtbase/configure -top-level
'/usr/bin/cmake' '-G' 'Ninja' '/home/supernova/tmp/qt-everywhere-src-6.4.2'
Checking dependencies of submodule 'qtbase'
Checking dependencies of submodule 'qtimageformats'
Checking dependencies of submodule 'qtlanguageserver'
Checking dependencies of submodule 'qtshadertools'
Checking dependencies of submodule 'qtsvg'
Checking dependencies of submodule 'qtdeclarative'
Checking dependencies of submodule 'qtquicktimeline'
Checking dependencies of submodule 'qtquick3d'
Checking dependencies of submodule 'qtmultimedia'
Checking dependencies of submodule 'qt3d'
Checking dependencies of submodule 'qt5compat'
Checking dependencies of submodule 'qtactiveqt'
Checking dependencies of submodule 'qtcharts'
Checking dependencies of submodule 'qtcoap'
Checking dependencies of submodule 'qtconnectivity'
Checking dependencies of submodule 'qtdatavis3d'
Checking dependencies of submodule 'qtwebsockets'
Checking dependencies of submodule 'qthttpserver'
Checking dependencies of submodule 'qttools'
Checking dependencies of submodule 'qtdoc'
Checking dependencies of submodule 'qtlottie'
Checking dependencies of submodule 'qtmqtt'
Checking dependencies of submodule 'qtnetworkauth'
Checking dependencies of submodule 'qtopcua'
Checking dependencies of submodule 'qtserialport'
Checking dependencies of submodule 'qtpositioning'
Checking dependencies of submodule 'qtquick3dphysics'
Checking dependencies of submodule 'qtremoteobjects'
Checking dependencies of submodule 'qtscxml'
Checking dependencies of submodule 'qtsensors'
Checking dependencies of submodule 'qtserialbus'
Checking dependencies of submodule 'qtspeech'
Checking dependencies of submodule 'qttranslations'
Checking dependencies of submodule 'qtvirtualkeyboard'
Checking dependencies of submodule 'qtwayland'
Checking dependencies of submodule 'qtwebchannel'
Checking dependencies of submodule 'qtwebengine'
Checking dependencies of submodule 'qtwebview'
Configuring submodule 'qtbase'
    'qtwebengine_build' is changed from OFF to ON
    'qtpdf_build' is changed from OFF to ON
    'qtwebengine_core_build' is changed from OFF to ON
    'qtwebengine_widgets_build' is changed from OFF to ON
    'qtwebengine_quick_build' is changed from OFF to ON
    'qtpdf_widgets_build' is changed from OFF to ON
    'qtpdf_quick_build' is changed from OFF to ON
CMake Warning at qtbase/cmake/QtSetup.cmake:325 (message):
  Re-configuring in existing build folder.  Some features will be
  re-evaluated automatically.
Call Stack (most recent call first):
  qtbase/cmake/QtBuildInternals/QtBuildInternalsConfig.cmake:237 (include)
  qtbase/cmake/QtBuildInternals/QtBuildInternalsConfig.cmake:382 (qt_build_internals_set_up_private_api)
  qtbase/CMakeLists.txt:109 (qt_build_repo_begin)


-- Could NOT find md4c (missing: md4c_DIR)
CMake Warning (dev) at qtbase/cmake/3rdparty/extra-cmake-modules/find-modules/FindXCB.cmake:180 (message):
  XINPUT from XCB was requested: this is EXPERIMENTAL and is likely to
  unavailable on many systems!
Call Stack (most recent call first):
  qtbase/cmake/QtFindPackageHelpers.cmake:130 (find_package)
  qtbase/src/gui/configure.cmake:123 (qt_find_package)
  qtbase/cmake/QtFeature.cmake:573 (include)
  qtbase/src/CMakeLists.txt:12 (qt_feature_evaluate_features)
This warning is for project developers.  Use -Wno-dev to suppress it.

-- Could NOT find md4c (missing: md4c_DIR)
CMake Warning (dev) at qtbase/cmake/3rdparty/extra-cmake-modules/find-modules/FindXCB.cmake:180 (message):
  XINPUT from XCB was requested: this is EXPERIMENTAL and is likely to
  unavailable on many systems!
Call Stack (most recent call first):
  qtbase/cmake/QtFindPackageHelpers.cmake:130 (find_package)
  qtbase/src/gui/configure.cmake:123 (qt_find_package)
  qtbase/cmake/QtModuleHelpers.cmake:612 (include)
  qtbase/src/gui/CMakeLists.txt:53 (qt_internal_add_module)
This warning is for project developers.  Use -Wno-dev to suppress it.

Configuring submodule 'qtimageformats'
Configuring submodule 'qtlanguageserver'
Configuring submodule 'qtshadertools'
Configuring submodule 'qtsvg'
Configuring submodule 'qtdeclarative'
Configuring submodule 'qtquicktimeline'
Configuring submodule 'qtquick3d'
Configuring submodule 'qtmultimedia'
Configuring submodule 'qt3d'
Skipping the build as the condition "QT_FEATURE_opengl AND NOT WASM" is not met.
Configuring submodule 'qt5compat'
CMake Warning (dev) at /home/supernova/dev/qt-build/qtbase/lib/cmake/Qt6Qml/Qt6QmlBuildInternals.cmake:410 (message):
  INSTALL_SOURCE_QMLTYPES option is deprecated and should not be used.
  Please port your module to use declarative type registration.
Call Stack (most recent call first):
  qt5compat/src/imports/graphicaleffects5/CMakeLists.txt:33 (qt_internal_add_qml_module)
This warning is for project developers.  Use -Wno-dev to suppress it.

Configuring submodule 'qtactiveqt'
Condition "WIN32" is not met, enabling documentation build only.
Configuring submodule 'qtcharts'
-- Found XKB: /usr/lib/x86_64-linux-gnu/libxkbcommon.so (found suitable version "1.4.0", minimum required is "0.5.0") 
-- Could NOT find Qt6OpenGL (missing: Qt6OpenGL_DIR)
CMake Warning at /home/supernova/dev/qt-build/qtbase/lib/cmake/Qt6/Qt6Config.cmake:214 (message):
  Failed to find optional Qt component "OpenGL".

  Expected Config file at
  "/home/supernova/dev/qt-build/qtbase/lib/cmake/Qt6OpenGL/Qt6OpenGLConfig.cmake"
  does NOT exist

Call Stack (most recent call first):
  qtcharts/CMakeLists.txt:17 (find_package)


-- Could NOT find Qt6OpenGLWidgets (missing: Qt6OpenGLWidgets_DIR)
CMake Warning at /home/supernova/dev/qt-build/qtbase/lib/cmake/Qt6/Qt6Config.cmake:214 (message):
  Failed to find optional Qt component "OpenGLWidgets".

  Expected Config file at
  "/home/supernova/dev/qt-build/qtbase/lib/cmake/Qt6OpenGLWidgets/Qt6OpenGLWidgetsConfig.cmake"
  does NOT exist

Call Stack (most recent call first):
  qtcharts/CMakeLists.txt:17 (find_package)


Configuring submodule 'qtcoap'
Configuring submodule 'qtconnectivity'
Configuring submodule 'qtdatavis3d'
-- Could NOT find Qt6OpenGL (missing: Qt6OpenGL_DIR)
CMake Warning at /home/supernova/dev/qt-build/qtbase/lib/cmake/Qt6/Qt6Config.cmake:214 (message):
  Failed to find optional Qt component "OpenGL".

  Expected Config file at
  "/home/supernova/dev/qt-build/qtbase/lib/cmake/Qt6OpenGL/Qt6OpenGLConfig.cmake"
  does NOT exist

Call Stack (most recent call first):
  qtdatavis3d/CMakeLists.txt:12 (find_package)


Skipping the build as the condition "TARGET Qt::OpenGL" is not met.
Configuring submodule 'qtwebsockets'
CMake Warning (dev) at /home/supernova/dev/qt-build/qtbase/lib/cmake/Qt6Qml/Qt6QmlBuildInternals.cmake:410 (message):
  INSTALL_SOURCE_QMLTYPES option is deprecated and should not be used.
  Please port your module to use declarative type registration.
Call Stack (most recent call first):
  qtwebsockets/src/imports/qmlwebsockets/CMakeLists.txt:1 (qt_internal_add_qml_module)
This warning is for project developers.  Use -Wno-dev to suppress it.

Configuring submodule 'qthttpserver'
Configuring submodule 'qttools'
-- Could NOT find Clang (missing: Clang_DIR)
-- Could NOT find Clang (missing: Clang_DIR)
QtDesigner: WARNING: /home/supernova/tmp/qt-everywhere-src-6.4.2/qttools/src/designer/src/lib/uilib/abstractformbuilder.h includes uilib_global.h when it should include QtDesigner/uilib_global.h
QtDesigner: WARNING: /home/supernova/tmp/qt-everywhere-src-6.4.2/qttools/src/designer/src/lib/uilib/formbuilder.h includes uilib_global.h when it should include QtDesigner/uilib_global.h
QtDesigner: WARNING: /home/supernova/tmp/qt-everywhere-src-6.4.2/qttools/src/designer/src/lib/uilib/formbuilder.h includes abstractformbuilder.h when it should include QtDesigner/abstractformbuilder.h
Configuring submodule 'qtdoc'
Configuring submodule 'qtlottie'
Configuring submodule 'qtmqtt'
Configuring submodule 'qtnetworkauth'
Configuring submodule 'qtopcua'
Configuring submodule 'qtserialport'
Configuring submodule 'qtpositioning'
Configuring submodule 'qtquick3dphysics'
Configuring submodule 'qtremoteobjects'
Configuring submodule 'qtscxml'
-- Could NOT find Qt6OpenGL (missing: Qt6OpenGL_DIR)
CMake Warning at /home/supernova/dev/qt-build/qtbase/lib/cmake/Qt6/Qt6Config.cmake:214 (message):
  Failed to find optional Qt component "OpenGL".

  Expected Config file at
  "/home/supernova/dev/qt-build/qtbase/lib/cmake/Qt6OpenGL/Qt6OpenGLConfig.cmake"
  does NOT exist

Call Stack (most recent call first):
  qtscxml/CMakeLists.txt:12 (find_package)


-- Could NOT find Qt6OpenGLWidgets (missing: Qt6OpenGLWidgets_DIR)
CMake Warning at /home/supernova/dev/qt-build/qtbase/lib/cmake/Qt6/Qt6Config.cmake:214 (message):
  Failed to find optional Qt component "OpenGLWidgets".

  Expected Config file at
  "/home/supernova/dev/qt-build/qtbase/lib/cmake/Qt6OpenGLWidgets/Qt6OpenGLWidgetsConfig.cmake"
  does NOT exist

Call Stack (most recent call first):
  qtscxml/CMakeLists.txt:12 (find_package)


Configuring submodule 'qtsensors'
Configuring submodule 'qtserialbus'
Configuring submodule 'qtspeech'
Configuring submodule 'qttranslations'
CMake Warning at qttranslations/translations/CMakeLists.txt:37 (message):
  Directory
  '/home/supernova/tmp/qt-everywhere-src-6.4.2/qttranslations/translations/../../qtlocation/src'
  for qtlocation does not exist.  Skipping...
Call Stack (most recent call first):
  qttranslations/translations/CMakeLists.txt:105 (add_ts_targets)


CMake Warning at qttranslations/translations/CMakeLists.txt:44 (message):
  No source files located for qtlocation, skipping target creation
Call Stack (most recent call first):
  qttranslations/translations/CMakeLists.txt:105 (add_ts_targets)


Configuring submodule 'qtvirtualkeyboard'
QtVirtualKeyboard: WARNING: /home/supernova/tmp/qt-everywhere-src-6.4.2/qtvirtualkeyboard/src/virtualkeyboard/qvirtualkeyboard_namespace.h does not include QT_BEGIN_NAMESPACE
Configuring submodule 'qtwayland'
CMake Warning at qtwayland/src/CMakeLists.txt:7 (message):
  QtWayland is missing required dependencies, nothing will be built.
  Although this could be considered an error, the configuration will still
  pass as coin (Qt's continuous integration system) will fail the build if
  configure fails, but will still try to configure the module on targets that
  are missing dependencies.


Configuring submodule 'qtwebchannel'
CMake Warning (dev) at /home/supernova/dev/qt-build/qtbase/lib/cmake/Qt6Qml/Qt6QmlBuildInternals.cmake:410 (message):
  INSTALL_SOURCE_QMLTYPES option is deprecated and should not be used.
  Please port your module to use declarative type registration.
Call Stack (most recent call first):
  qtwebchannel/src/imports/webchannel/CMakeLists.txt:7 (qt_internal_add_qml_module)
This warning is for project developers.  Use -Wno-dev to suppress it.

Configuring submodule 'qtwebengine'
Traceback (most recent call last):
  File "<string>", line 1, in <module>
ModuleNotFoundError: No module named 'html5lib'
-- Checking 'ulimit -n'
 -- Open files limit 1024
 -- Creating linker launcher
-- Support check for QtWebEngine failed: node.js version 12 or later is required.
-- Support check for QtPdf failed: node.js version 12 or later is required.
Configuring submodule 'qtwebview'
-- Could NOT find Qt6OpenGL (missing: Qt6OpenGL_DIR)
CMake Warning at /home/supernova/dev/qt-build/qtbase/lib/cmake/Qt6/Qt6Config.cmake:214 (message):
  Failed to find optional Qt component "OpenGL".

  Expected Config file at
  "/home/supernova/dev/qt-build/qtbase/lib/cmake/Qt6OpenGL/Qt6OpenGLConfig.cmake"
  does NOT exist

Call Stack (most recent call first):
  qtwebview/CMakeLists.txt:12 (find_package)


-- Could NOT find Qt6WebEngineCore (missing: Qt6WebEngineCore_DIR)
CMake Warning at /home/supernova/dev/qt-build/qtbase/lib/cmake/Qt6/Qt6Config.cmake:214 (message):
  Failed to find optional Qt component "WebEngineCore".

  Expected Config file at
  "/home/supernova/dev/qt-build/qtbase/lib/cmake/Qt6WebEngineCore/Qt6WebEngineCoreConfig.cmake"
  does NOT exist

Call Stack (most recent call first):
  qtwebview/CMakeLists.txt:12 (find_package)


-- Could NOT find Qt6WebEngineQuick (missing: Qt6WebEngineQuick_DIR)
CMake Warning at /home/supernova/dev/qt-build/qtbase/lib/cmake/Qt6/Qt6Config.cmake:214 (message):
  Failed to find optional Qt component "WebEngineQuick".

  Expected Config file at
  "/home/supernova/dev/qt-build/qtbase/lib/cmake/Qt6WebEngineQuick/Qt6WebEngineQuickConfig.cmake"
  does NOT exist

Call Stack (most recent call first):
  qtwebview/CMakeLists.txt:12 (find_package)

 

-- Configuration summary shown below. It has also been written to /home/supernova/dev/qt-build/config.summary
-- Configure with --log-level=STATUS or higher to increase CMake's message verbosity. The log level does not persist across reconfigurations.
 
-- Configure summary:

Building for: linux-g++ (x86_64, CPU features: mmx sse sse2)
Compiler: gcc 11.4.0
Build options:
  Mode ................................... release
  Optimize release build for size ........ no
  Fully optimize release builds (-O3) .... no
  Building shared libraries .............. yes
  Using C standard ....................... C11
  Using C++ standard ..................... C++17
  Using ccache ........................... no
  Using new DTAGS ........................ yes
  Relocatable ............................ yes
  Using precompiled headers .............. yes
  Using LTCG ............................. no
  Using Intel CET ........................ yes
  Target compiler supports:
    SSE .................................. SSE2 SSE3 SSSE3 SSE4.1 SSE4.2
    AVX .................................. AVX AVX2 VAES
    AVX512 ............................... F ER CD PF DQ BW VL IFMA VBMI AVX512VBMI2
    Other x86 ............................ AES F16C RDRAND SHA
  Sanitizers:
    Addresses ............................ no
    Threads .............................. no
    Memory ............................... no
    Fuzzer (instrumentation only) ........ no
    Undefined ............................ no
  Build parts ............................ libs tools
Qt modules and options:
  Qt Concurrent .......................... yes
  Qt D-Bus ............................... yes
  Qt D-Bus directly linked to libdbus .... no
  Qt Gui ................................. yes
  Qt Network ............................. yes
  Qt PrintSupport ........................ yes
  Qt Sql ................................. yes
  Qt Testlib ............................. yes
  Qt Widgets ............................. yes
  Qt Xml ................................. yes
Support enabled for:
  Using pkg-config ....................... yes
  udev ................................... no
  Using system zlib ...................... no
  Zstandard support ...................... no
  Thread support ......................... yes
Common build options:
  Linker can resolve circular dependencies  yes
Qt Core:
  backtrace .............................. yes
  DoubleConversion ....................... yes
    Using system DoubleConversion ........ no
  GLib ................................... yes
  ICU .................................... no
  Using system libb2 ..................... no
  Built-in copy of the MIME database ..... yes
  cpp/winrt base ......................... no
  Tracing backend ........................ <none>
  Logging backends:
    journald ............................. no
    syslog ............................... no
    slog2 ................................ no
  PCRE2 .................................. yes
    Using system PCRE2 ................... no
  CLONE_PIDFD support in forkfd .......... yes
Qt Sql:
  SQL item models ........................ yes
Qt Network:
  getifaddrs() ........................... yes
  IPv6 ifname ............................ yes
  libproxy ............................... no
  Linux AF_NETLINK ....................... yes
  OpenSSL ................................ no
    Qt directly linked to OpenSSL ........ no
  OpenSSL 1.1 ............................ no
  DTLS ................................... no
  OCSP-stapling .......................... no
  SCTP ................................... no
  Use system proxies ..................... yes
  GSSAPI ................................. no
  Brotli Decompression Support ........... no
  qTopLevelDomain() ...................... yes
    Built-in publicsuffix database ....... yes
    System publicsuffix database ......... yes
Core tools:
  Android deployment tool ................ yes
  macOS deployment tool .................. no
  Windows deployment tool ................ no
  qmake .................................. yes
Qt Gui:
  Accessibility .......................... yes
  FreeType ............................... yes
    Using system FreeType ................ no
  HarfBuzz ............................... yes
    Using system HarfBuzz ................ no
  Fontconfig ............................. no
  Image formats:
    GIF .................................. yes
    ICO .................................. yes
    JPEG ................................. yes
      Using system libjpeg ............... no
    PNG .................................. yes
      Using system libpng ................ no
  Text formats:
    HtmlParser ........................... yes
    CssParser ............................ yes
    OdfWriter ............................ yes
    MarkdownReader ....................... yes
      Using system libmd4c ............... no
    MarkdownWriter ....................... yes
  EGL .................................... no
  OpenVG ................................. no
  OpenGL:
    Desktop OpenGL ....................... no
    OpenGL ES 2.0 ........................ no
    OpenGL ES 3.0 ........................ no
    OpenGL ES 3.1 ........................ no
    OpenGL ES 3.2 ........................ no
  Vulkan ................................. no
  Session Management ..................... yes
Features used by QPA backends:
  evdev .................................. yes
  libinput ............................... no
  HiRes wheel support in libinput ........ no
  INTEGRITY HID .......................... no
  mtdev .................................. no
  tslib .................................. no
  xkbcommon .............................. yes
  X11 specific:
    XLib ................................. yes
    XCB Xlib ............................. yes
    EGL on X11 ........................... no
    xkbcommon-x11 ........................ no
    xcb-sm ............................... no
QPA backends:
  DirectFB ............................... no
  EGLFS .................................. no
  EGLFS details:
    EGLFS OpenWFD ........................ no
    EGLFS i.Mx6 .......................... no
    EGLFS i.Mx6 Wayland .................. no
    EGLFS RCAR ........................... no
    EGLFS EGLDevice ...................... no
    EGLFS GBM ............................ no
    EGLFS VSP2 ........................... no
    EGLFS Mali ........................... no
    EGLFS Raspberry Pi ................... no
    EGLFS X11 ............................ no
  LinuxFB ................................ yes
  VNC .................................... yes
  VK_KHR_display ......................... no
  QNX:
    lgmon ................................ no
    IMF .................................. no
  XCB:
    Using system-provided xcb-xinput ..... no
    GL integrations:
      GLX Plugin ......................... no
        XCB GLX .......................... no
      EGL-X11 Plugin ..................... no
  Windows:
    Direct 2D ............................ no
    Direct 2D 1.1 ........................ no
    DirectWrite .......................... no
    DirectWrite 3 ........................ no
Qt Widgets:
  GTK+ ................................... no
  Styles ................................. Fusion Windows
Qt Testlib:
  Tester for item models ................. yes
Qt PrintSupport:
  CUPS ................................... no
Qt Sql Drivers:
  DB2 (IBM) .............................. no
  InterBase .............................. no
  MySql .................................. no
  OCI (Oracle) ........................... no
  ODBC ................................... no
  PostgreSQL ............................. no
  SQLite ................................. yes
    Using system provided SQLite ......... no
Further Image Formats:
  JasPer ................................. no
  MNG .................................... no
  TIFF ................................... yes
    Using system libtiff ................. no
  WEBP ................................... yes
    Using system libwebp ................. no
Qt QML:
  QML network support .................... yes
  QML debugging and profiling support .... yes
  QML just-in-time compiler .............. yes
  QML XML http request ................... yes
  QML Locale ............................. yes
Qt QML Models:
  QML list model ......................... yes
  QML delegate model ..................... yes
Qt Quick:
  AnimatedImage item ..................... yes
  Canvas item ............................ yes
  Support for Qt Quick Designer .......... yes
  Flipable item .......................... yes
  GridView item .......................... yes
  ListView item .......................... yes
  TableView item ......................... yes
  TreeView item .......................... yes
  Path support ........................... yes
  PathView item .......................... yes
  Positioner items ....................... yes
  Repeater item .......................... yes
  ShaderEffect item ...................... yes
  Sprite item ............................ yes
Qt Quick Templates 2:
  Hover support .......................... yes
  Multi-touch support .................... yes
  Calendar support ....................... yes
Qt Quick Controls 2:
  Styles ................................. Basic Fusion Imagine iOS Material Universal macOS Windows
QtQuick3D:
  Assimp ................................. yes
  System Assimp .......................... no
Qt Multimedia:
  Spatial Audio .......................... yes
  Spatial Audio (Quick3D) ................ yes
  Low level Audio Backend:
    ALSA (experimental) .................. no
    PulseAudio ........................... no
    MMRenderer ........................... no
    CoreAudio ............................ no
    Windows Media SDK .................... no
    Open SLES (Android) .................. no
    Web Assembly ......................... no
  Plugin:
    GStreamer 1.0 ........................ no
    FFmpeg ............................... no
    MMRenderer ........................... no
    AVFoundation ......................... no
    Windows Media Foundation ............. no
  Hardware acceleration and features:
    Video for Linux ...................... yes
    VAAPI support ........................ no
    Linux DMA buffer support ............. no
    VideoToolbox ......................... no
Qt 5 Compatibility Libraries:
  iconv .................................. yes
Qt Charts Types:
  Area Chart ............................. yes
  Line Chart ............................. yes
  Spline Chart ........................... yes
  Scatter Chart .......................... yes
  Bar Chart .............................. yes
  Pie Chart .............................. yes
  Boxplot Chart .......................... yes
  Candlestick Chart ...................... yes
Qt Axis Types:
  DateTime Axis .......................... yes
Qt Bluetooth:
  BlueZ .................................. no
  BlueZ Low Energy ....................... no
  Linux Crypto API ....................... no
  WinRT Bluetooth API .................... no
Qt Tools:
  Qt Assistant ........................... yes
  QDoc ................................... no
  Clang-based lupdate parser ............. no
  Qt Designer ............................ yes
  Qt Distance Field Generator ............ yes
  Qt Linguist ............................ yes
  pixeltool .............................. yes
  qdbus .................................. yes
  Qt Attributions Scanner ................ yes
  qtdiag ................................. yes
  qtplugininfo ........................... yes
Qt Opcua:
  Open62541 .............................. yes
  Unified Automation C++ SDK ............. no
  Support for namespace 0 NodeId names ... yes
  Namespace 0 NodeIds generator .......... no
  Open62541 security support ............. no
  Support for global discovery server .... no
Serial Port:
  ntddmodm ............................... no
Qt Remote Objects:
  High Availability Manager (ham) ........ no
Qt Scxml:
  ECMAScript data model for QtScxml ...... yes
Qt Sensors:
  sensorfw ............................... no
  sensorfw_enabled_with_cmake ............ no
Qt SerialBus:
  Socket CAN ............................. yes
  Socket CAN FD .......................... yes
  SerialPort Support ..................... yes
Qt TextToSpeech:
  Flite .................................. no
  Flite with ALSA ........................ no
  Speech Dispatcher ...................... no
Qt Virtualkeyboard:
  Desktop integration .................... yes
  Built-in layouts ....................... yes
  Key navigation ......................... no
  Retro style as default ................. no
  Sensitive Debug ........................ no
  Cerence ................................ no
    Static Linking ....................... no
    Handwriting .......................... no
      Alphabetic ......................... no
      CJK ................................ no
    XT9 .................................. no
      XT9 Debug .......................... no
      XT9 9-key layouts .................. no
    Bundle resources ..................... no
      Handwriting ........................ no
      XT9 ................................ no
  Hunspell ............................... no
    Using Hunspell copy from 3rdparty/ ... no
  OpenWnn ................................ yes
  MyScript ............................... no
  Language support enabled for:
    Arabic ............................... yes
    Bulgarian ............................ yes
    Czech ................................ yes
    Danish ............................... yes
    German ............................... yes
    Greek ................................ yes
    English GB ........................... yes
    English US ........................... yes
    Spanish .............................. yes
    Spanish Mexico ....................... yes
    Estonian ............................. yes
    Farsi ................................ yes
    Finnish .............................. yes
    French Canada ........................ yes
    French France ........................ yes
    Hebrew ............................... yes
    Hindi ................................ yes
    Croatian ............................. yes
    Hungarian ............................ yes
    Indonesian ........................... yes
    Italian .............................. yes
    Japanese ............................. yes
    Korean ............................... yes
    Malay ................................ yes
    Norwegian ............................ yes
    Dutch ................................ yes
    Polish ............................... yes
    Portuguese Brazil .................... yes
    Portuguese Portugal .................. yes
    Romanian ............................. yes
    Russian .............................. yes
    Slovak ............................... yes
    Slovenian ............................ yes
    Albanian ............................. yes
    Serbian .............................. yes
    Swedish .............................. yes
    Thai ................................. yes
    Turkish .............................. yes
    Ukrainian ............................ yes
    Vietnamese ........................... yes
    Simplified Chinese ................... yes
    Traditional Chinese .................. yes
    HongKong Chinese ..................... no
  Traditional chinese input methods:
    Zhuyin ............................... yes
    Cangjie .............................. yes
WebEngine Repository Build Options:
  Build Ninja ............................ no
  Build Gn ............................... yes
  Jumbo Build ............................ yes
  Developer build ........................ no
  Build QtWebEngine Modules:
    Build QtWebEngineCore ................ no
    Build QtWebEngineWidgets ............. no
    Build QtWebEngineQuick ............... no
  Build QtPdf Modules:
    Build QtPdfWidgets ................... no
    Build QtPdfQuick ..................... no
  Optional system libraries:
    re2 .................................. no
    icu .................................. no
    libwebp, libwebpmux and libwebpdemux . no
    opus ................................. no
    ffmpeg ............................... no
    libvpx ............................... no
    snappy ............................... no
    glib ................................. no
    zlib ................................. no
    minizip .............................. no
    libevent ............................. no
    libxml2 and libxslt .................. no
    lcms2 ................................ no
    png .................................. no
    jpeg ................................. no
    harfbuzz ............................. no
    freetype ............................. no
    libpci ............................... no
 

Note: Hunspell in Qt Virtual Keyboard is not enabled. Spelling correction will not be available.

WARNING: No backend for low level audio found.
WARNING: QDoc will not be compiled, probably because libclang could not be located. This means that you cannot build the Qt documentation.
Either set CMAKE_PREFIX_PATH or LLVM_INSTALL_DIR to the location of your llvm installation.
On Linux systems, you may be able to install libclang by installing the libclang-dev or libclang-devel package, depending on your distribution.
On macOS, you can use Homebrew's llvm package.
You will also need to set the FEATURE_clang CMake variable to ON to re-evaluate this check.
WARNING: Clang-based lupdate parser will not be available. LLVM and Clang C++ libraries have not been found.
You will need to set the FEATURE_clangcpp CMake variable to ON to re-evaluate this check.
WARNING: QtWebEngine won't be built. node.js version 12 or later is required.
WARNING: QtPdf won't be built. node.js version 12 or later is required.

ERROR: The OpenGL functionality tests failed! You might need to modify the OpenGL package search path by setting the OpenGL_DIR CMake variable to the OpenGL library's installation directory.

CMake Error at qtbase/cmake/QtBuildInformation.cmake:181 (message):
  Check the configuration messages for an error that has occurred.
Call Stack (most recent call first):
  qtbase/cmake/QtBuildInformation.cmake:21 (qt_configure_print_summary)
  CMakeLists.txt:111 (qt_print_feature_summary)


-- Configuring incomplete, errors occurred!
See also "/home/supernova/dev/qt-build/CMakeFiles/CMakeOutput.log".
See also "/home/supernova/dev/qt-build/CMakeFiles/CMakeError.log".
CMake Error at /home/supernova/tmp/qt-everywhere-src-6.4.2/qtbase/cmake/QtProcessConfigureArgs.cmake:965 (message):
  CMake exited with code 1.


supernova@supernova-BOHB-WAX9:~/dev/qt-build$ cat /home/supernova/dev/qt-build/CMakeFiles/CMakeError.log
Performing C++ SOURCE FILE Test TEST_use_lld_linker failed with the following output:
Change Dir: /home/supernova/dev/qt-build/CMakeFiles/CMakeTmp

Run Build Command(s):/usr/bin/ninja cmTC_3db9f && [1/2] Building CXX object CMakeFiles/cmTC_3db9f.dir/src.cxx.o
[2/2] Linking CXX executable cmTC_3db9f
FAILED: cmTC_3db9f 
: && /usr/bin/g++  -fuse-ld=lld CMakeFiles/cmTC_3db9f.dir/src.cxx.o -o cmTC_3db9f   && :
collect2: fatal error: cannot find ‘ld’
compilation terminated.
ninja: build stopped: subcommand failed.


Source file was:
int main() { return 0; }
Performing C++ SOURCE FILE Test TEST_gdb_index failed with the following output:
Change Dir: /home/supernova/dev/qt-build/CMakeFiles/CMakeTmp

Run Build Command(s):/usr/bin/ninja cmTC_36f48 && [1/2] Building CXX object CMakeFiles/cmTC_36f48.dir/src.cxx.o
[2/2] Linking CXX executable cmTC_36f48
FAILED: cmTC_36f48 
: && /usr/bin/g++  -Wl,--gdb-index CMakeFiles/cmTC_36f48.dir/src.cxx.o -o cmTC_36f48   && :
/usr/bin/ld: unrecognized option '--gdb-index'
/usr/bin/ld: use the --help option for usage information
collect2: error: ld returned 1 exit status
ninja: build stopped: subcommand failed.


Source file was:
int main() { return 0; }
Performing C++ SOURCE FILE Test HAVE_alloca_malloc_h failed with the following output:
Change Dir: /home/supernova/dev/qt-build/CMakeFiles/CMakeTmp

Run Build Command(s):/usr/bin/ninja cmTC_83990 && [1/2] Building CXX object CMakeFiles/cmTC_83990.dir/src.cxx.o
FAILED: CMakeFiles/cmTC_83990.dir/src.cxx.o 
/usr/bin/g++ -DHAVE_alloca_malloc_h  -fPIE -o CMakeFiles/cmTC_83990.dir/src.cxx.o -c /home/supernova/dev/qt-build/CMakeFiles/CMakeTmp/src.cxx
/home/supernova/dev/qt-build/CMakeFiles/CMakeTmp/src.cxx: In function ‘int main()’:
/home/supernova/dev/qt-build/CMakeFiles/CMakeTmp/src.cxx:6:1: error: ‘alloca’ was not declared in this scope; did you mean ‘valloc’?
    6 | alloca(1);
      | ^~~~~~
      | valloc
ninja: build stopped: subcommand failed.


Source file was:
 #include <malloc.h>

int main(void)
{
    /* BEGIN TEST: */
alloca(1);
    /* END TEST: */
    return 0;
}

Performing C++ SOURCE FILE Test HAVE_pollts failed with the following output:
Change Dir: /home/supernova/dev/qt-build/CMakeFiles/CMakeTmp

Run Build Command(s):/usr/bin/ninja cmTC_2ae6e && [1/2] Building CXX object CMakeFiles/cmTC_2ae6e.dir/src.cxx.o
FAILED: CMakeFiles/cmTC_2ae6e.dir/src.cxx.o 
/usr/bin/g++ -DHAVE_pollts  -fPIE -o CMakeFiles/cmTC_2ae6e.dir/src.cxx.o -c /home/supernova/dev/qt-build/CMakeFiles/CMakeTmp/src.cxx
/home/supernova/dev/qt-build/CMakeFiles/CMakeTmp/src.cxx: In function ‘int main()’:
/home/supernova/dev/qt-build/CMakeFiles/CMakeTmp/src.cxx:11:1: error: ‘pollts’ was not declared in this scope; did you mean ‘pollfd’?
   11 | pollts(&pfd, 1, &ts, &sig);
      | ^~~~~~
      | pollfd
ninja: build stopped: subcommand failed.


Source file was:
 #include <poll.h>
#include <signal.h>
#include <time.h>

int main(void)
{
    /* BEGIN TEST: */
struct pollfd pfd;
struct timespec ts;
sigset_t sig;
pollts(&pfd, 1, &ts, &sig);
    /* END TEST: */
    return 0;
}

Performing C++ SOURCE FILE Test HAVE_cpp_winrt failed with the following output:
Change Dir: /home/supernova/dev/qt-build/CMakeFiles/CMakeTmp

Run Build Command(s):/usr/bin/ninja cmTC_3dda2 && [1/2] Building CXX object CMakeFiles/cmTC_3dda2.dir/src.cxx.o
FAILED: CMakeFiles/cmTC_3dda2.dir/src.cxx.o 
/usr/bin/g++ -DHAVE_cpp_winrt  -fPIE -o CMakeFiles/cmTC_3dda2.dir/src.cxx.o -c /home/supernova/dev/qt-build/CMakeFiles/CMakeTmp/src.cxx
/home/supernova/dev/qt-build/CMakeFiles/CMakeTmp/src.cxx:2:13: fatal error: winrt/base.h: No such file or directory
    2 | #   include <winrt/base.h>
      |             ^~~~~~~~~~~~~~
compilation terminated.
ninja: build stopped: subcommand failed.


Source file was:
 // Including winrt/base.h causes an error in some configurations (Windows 10 SDK + c++20)
#   include <winrt/base.h>

int main(void)
{
    return 0;
}

Performing C++ SOURCE FILE Test HAVE_xlocalescanprint failed with the following output:
Change Dir: /home/supernova/dev/qt-build/CMakeFiles/CMakeTmp

Run Build Command(s):/usr/bin/ninja cmTC_03b96 && [1/2] Building CXX object CMakeFiles/cmTC_03b96.dir/src.cxx.o
FAILED: CMakeFiles/cmTC_03b96.dir/src.cxx.o 
/usr/bin/g++ -DHAVE_xlocalescanprint  -fPIE -o CMakeFiles/cmTC_03b96.dir/src.cxx.o -c /home/supernova/dev/qt-build/CMakeFiles/CMakeTmp/src.cxx
/home/supernova/dev/qt-build/CMakeFiles/CMakeTmp/src.cxx:10:10: error: #include expects "FILENAME" or <FILENAME>
   10 | #include QDSP_P_H
      |          ^~~~~~~~
/home/supernova/dev/qt-build/CMakeFiles/CMakeTmp/src.cxx: In function ‘int main()’:
/home/supernova/dev/qt-build/CMakeFiles/CMakeTmp/src.cxx:18:1: error: ‘locale_t’ was not declared in this scope
   18 | locale_t invalidLocale = NULL;
      | ^~~~~~~~
/home/supernova/dev/qt-build/CMakeFiles/CMakeTmp/src.cxx:21:17: error: ‘argv’ was not declared in this scope
   21 | qDoubleSnprintf(argv[0], 1, invalidLocale, "invalid format", a);
      |                 ^~~~
/home/supernova/dev/qt-build/CMakeFiles/CMakeTmp/src.cxx:21:29: error: ‘invalidLocale’ was not declared in this scope
   21 | qDoubleSnprintf(argv[0], 1, invalidLocale, "invalid format", a);
      |                             ^~~~~~~~~~~~~
/home/supernova/dev/qt-build/CMakeFiles/CMakeTmp/src.cxx:21:1: error: ‘qDoubleSnprintf’ was not declared in this scope
   21 | qDoubleSnprintf(argv[0], 1, invalidLocale, "invalid format", a);
      | ^~~~~~~~~~~~~~~
/home/supernova/dev/qt-build/CMakeFiles/CMakeTmp/src.cxx:22:62: error: ‘argc’ was not declared in this scope
   22 | qDoubleSscanf(argv[0], invalidLocale, "invalid format", &a, &argc);
      |                                                              ^~~~
/home/supernova/dev/qt-build/CMakeFiles/CMakeTmp/src.cxx:22:1: error: ‘qDoubleSscanf’ was not declared in this scope
   22 | qDoubleSscanf(argv[0], invalidLocale, "invalid format", &a, &argc);
      | ^~~~~~~~~~~~~
ninja: build stopped: subcommand failed.


Source file was:
 #define QT_BEGIN_NAMESPACE
#define QT_END_NAMESPACE

#ifdef _MSVC_VER
#define Q_CC_MSVC _MSVC_VER
#endif

#define QT_NO_DOUBLECONVERSION

#include QDSP_P_H

int main(void)
{
    /* BEGIN TEST: */
#ifdef _MSVC_VER
_locale_t invalidLocale = NULL;
#else
locale_t invalidLocale = NULL;
#endif
double a = 3.4;
qDoubleSnprintf(argv[0], 1, invalidLocale, "invalid format", a);
qDoubleSscanf(argv[0], invalidLocale, "invalid format", &a, &argc);
    /* END TEST: */
    return 0;
}

Performing C++ SOURCE FILE Test HAVE_ifr_index failed with the following output:
Change Dir: /home/supernova/dev/qt-build/CMakeFiles/CMakeTmp

Run Build Command(s):/usr/bin/ninja cmTC_07baf && [1/2] Building CXX object CMakeFiles/cmTC_07baf.dir/src.cxx.o
FAILED: CMakeFiles/cmTC_07baf.dir/src.cxx.o 
/usr/bin/g++ -DHAVE_ifr_index  -fPIE -o CMakeFiles/cmTC_07baf.dir/src.cxx.o -c /home/supernova/dev/qt-build/CMakeFiles/CMakeTmp/src.cxx
/home/supernova/dev/qt-build/CMakeFiles/CMakeTmp/src.cxx: In function ‘int main()’:
/home/supernova/dev/qt-build/CMakeFiles/CMakeTmp/src.cxx:7:5: error: ‘struct ifreq’ has no member named ‘ifr_index’
    7 | req.ifr_index = 0;
      |     ^~~~~~~~~
ninja: build stopped: subcommand failed.


Source file was:
 #include <net/if.h>

int main(void)
{
    /* BEGIN TEST: */
struct ifreq req;
req.ifr_index = 0;
    /* END TEST: */
    return 0;
}

Performing C++ SOURCE FILE Test HAVE_sctp failed with the following output:
Change Dir: /home/supernova/dev/qt-build/CMakeFiles/CMakeTmp

Run Build Command(s):/usr/bin/ninja cmTC_8202a && [1/2] Building CXX object CMakeFiles/cmTC_8202a.dir/src.cxx.o
FAILED: CMakeFiles/cmTC_8202a.dir/src.cxx.o 
/usr/bin/g++ -DHAVE_sctp  -fPIE -o CMakeFiles/cmTC_8202a.dir/src.cxx.o -c /home/supernova/dev/qt-build/CMakeFiles/CMakeTmp/src.cxx
/home/supernova/dev/qt-build/CMakeFiles/CMakeTmp/src.cxx:4:10: fatal error: netinet/sctp.h: No such file or directory
    4 | #include <netinet/sctp.h>
      |          ^~~~~~~~~~~~~~~~
compilation terminated.
ninja: build stopped: subcommand failed.


Source file was:
 #include <sys/types.h>
#include <sys/socket.h>
#include <netinet/in.h>
#include <netinet/sctp.h>

int main(void)
{
    /* BEGIN TEST: */
sctp_initmsg sctpInitMsg;
socklen_t sctpInitMsgSize = sizeof(sctpInitMsg);
(void) socket(PF_INET, SOCK_STREAM, IPPROTO_SCTP);
(void) getsockopt(-1, SOL_SCTP, SCTP_INITMSG, &sctpInitMsg, &sctpInitMsgSize);
    /* END TEST: */
    return 0;
}

Performing C++ SOURCE FILE Test HAVE_networklistmanager failed with the following output:
Change Dir: /home/supernova/dev/qt-build/CMakeFiles/CMakeTmp

Run Build Command(s):/usr/bin/ninja cmTC_3642d && [1/2] Building CXX object CMakeFiles/cmTC_3642d.dir/src.cxx.o
FAILED: CMakeFiles/cmTC_3642d.dir/src.cxx.o 
/usr/bin/g++ -DHAVE_networklistmanager  -fPIE -o CMakeFiles/cmTC_3642d.dir/src.cxx.o -c /home/supernova/dev/qt-build/CMakeFiles/CMakeTmp/src.cxx
/home/supernova/dev/qt-build/CMakeFiles/CMakeTmp/src.cxx:1:11: fatal error: netlistmgr.h: No such file or directory
    1 |  #include <netlistmgr.h>
      |           ^~~~~~~~~~~~~~
compilation terminated.
ninja: build stopped: subcommand failed.


Source file was:
 #include <netlistmgr.h>
#include <wrl/client.h>

int main(void)
{
    /* BEGIN TEST: */
using namespace Microsoft::WRL;
ComPtr<INetworkListManager> networkListManager;
ComPtr<IConnectionPoint> connectionPoint;
ComPtr<IConnectionPointContainer> connectionPointContainer;
networkListManager.As(&connectionPointContainer);
connectionPointContainer->FindConnectionPoint(IID_INetworkConnectionEvents, &connectionPoint);
    /* END TEST: */
    return 0;
}

Performing C++ SOURCE FILE Test HAVE_EGL failed with the following output:
Change Dir: /home/supernova/dev/qt-build/CMakeFiles/CMakeTmp

Run Build Command(s):/usr/bin/ninja cmTC_37436 && [1/2] Building CXX object CMakeFiles/cmTC_37436.dir/src.cxx.o
FAILED: CMakeFiles/cmTC_37436.dir/src.cxx.o 
/usr/bin/g++ -DHAVE_EGL  -fPIE -o CMakeFiles/cmTC_37436.dir/src.cxx.o -c /home/supernova/dev/qt-build/CMakeFiles/CMakeTmp/src.cxx
/home/supernova/dev/qt-build/CMakeFiles/CMakeTmp/src.cxx:2:10: fatal error: EGL/egl.h: No such file or directory
    2 | #include <EGL/egl.h>
      |          ^~~~~~~~~~~
compilation terminated.
ninja: build stopped: subcommand failed.


Source file was:

#include <EGL/egl.h>

int main(int, char **) {
    EGLint x = 0; EGLDisplay dpy = 0; EGLContext ctx = 0;
    eglDestroyContext(dpy, ctx);
}
Performing C++ SOURCE FILE Test HAVE_GLESv2 failed with the following output:
Change Dir: /home/supernova/dev/qt-build/CMakeFiles/CMakeTmp

Run Build Command(s):/usr/bin/ninja cmTC_b57e2 && [1/2] Building CXX object CMakeFiles/cmTC_b57e2.dir/src.cxx.o
FAILED: CMakeFiles/cmTC_b57e2.dir/src.cxx.o 
/usr/bin/g++ -DHAVE_GLESv2  -fPIE -o CMakeFiles/cmTC_b57e2.dir/src.cxx.o -c /home/supernova/dev/qt-build/CMakeFiles/CMakeTmp/src.cxx
/home/supernova/dev/qt-build/CMakeFiles/CMakeTmp/src.cxx:6:12: fatal error: GLES2/gl2.h: No such file or directory
    6 | #  include <GLES2/gl2.h>
      |            ^~~~~~~~~~~~~
compilation terminated.
ninja: build stopped: subcommand failed.


Source file was:

#ifdef __APPLE__
#  include <OpenGLES/ES2/gl.h>
#else
#  define GL_GLEXT_PROTOTYPES
#  include <GLES2/gl2.h>
#endif

int main(int, char **) {
    glUniform1f(1, GLfloat(1.0));
    glClear(GL_COLOR_BUFFER_BIT);
}
Performing C++ SOURCE FILE Test HAVE_integrityfb failed with the following output:
Change Dir: /home/supernova/dev/qt-build/CMakeFiles/CMakeTmp

Run Build Command(s):/usr/bin/ninja cmTC_1b94b && [1/2] Building CXX object CMakeFiles/cmTC_1b94b.dir/src.cxx.o
FAILED: CMakeFiles/cmTC_1b94b.dir/src.cxx.o 
/usr/bin/g++ -DHAVE_integrityfb  -fPIE -o CMakeFiles/cmTC_1b94b.dir/src.cxx.o -c /home/supernova/dev/qt-build/CMakeFiles/CMakeTmp/src.cxx
/home/supernova/dev/qt-build/CMakeFiles/CMakeTmp/src.cxx:1:11: fatal error: device/fbdriver.h: No such file or directory
    1 |  #include <device/fbdriver.h>
      |           ^~~~~~~~~~~~~~~~~~~
compilation terminated.
ninja: build stopped: subcommand failed.


Source file was:
 #include <device/fbdriver.h>

int main(void)
{
    /* BEGIN TEST: */
FBDriver *driver = 0;
    /* END TEST: */
    return 0;
}

Performing C++ SOURCE FILE Test HAVE_directwrite failed with the following output:
Change Dir: /home/supernova/dev/qt-build/CMakeFiles/CMakeTmp

Run Build Command(s):/usr/bin/ninja cmTC_5ab35 && [1/2] Building CXX object CMakeFiles/cmTC_5ab35.dir/src.cxx.o
FAILED: CMakeFiles/cmTC_5ab35.dir/src.cxx.o 
/usr/bin/g++ -DHAVE_directwrite  -fPIE -o CMakeFiles/cmTC_5ab35.dir/src.cxx.o -c /home/supernova/dev/qt-build/CMakeFiles/CMakeTmp/src.cxx
/home/supernova/dev/qt-build/CMakeFiles/CMakeTmp/src.cxx:1:11: fatal error: dwrite_2.h: No such file or directory
    1 |  #include <dwrite_2.h>
      |           ^~~~~~~~~~~~
compilation terminated.
ninja: build stopped: subcommand failed.


Source file was:
 #include <dwrite_2.h>
int main(int, char **)
{
    IUnknown *factory = nullptr;
    DWriteCreateFactory(DWRITE_FACTORY_TYPE_SHARED, __uuidof(IDWriteFactory2),
                        &factory);
    return 0;
}

Performing C++ SOURCE FILE Test HAVE_directwrite3 failed with the following output:
Change Dir: /home/supernova/dev/qt-build/CMakeFiles/CMakeTmp

Run Build Command(s):/usr/bin/ninja cmTC_bd135 && [1/2] Building CXX object CMakeFiles/cmTC_bd135.dir/src.cxx.o
FAILED: CMakeFiles/cmTC_bd135.dir/src.cxx.o 
/usr/bin/g++ -DHAVE_directwrite3  -fPIE -o CMakeFiles/cmTC_bd135.dir/src.cxx.o -c /home/supernova/dev/qt-build/CMakeFiles/CMakeTmp/src.cxx
/home/supernova/dev/qt-build/CMakeFiles/CMakeTmp/src.cxx:1:11: fatal error: dwrite_3.h: No such file or directory
    1 |  #include <dwrite_3.h>
      |           ^~~~~~~~~~~~
compilation terminated.
ninja: build stopped: subcommand failed.


Source file was:
 #include <dwrite_3.h>
int main(int, char **)
{
    IUnknown *factory = nullptr;
    DWriteCreateFactory(DWRITE_FACTORY_TYPE_SHARED, __uuidof(IDWriteFactory3),
                        &factory);
    return 0;
}

Performing C++ SOURCE FILE Test HAVE_d2d1 failed with the following output:
Change Dir: /home/supernova/dev/qt-build/CMakeFiles/CMakeTmp

Run Build Command(s):/usr/bin/ninja cmTC_d41f3 && [1/2] Building CXX object CMakeFiles/cmTC_d41f3.dir/src.cxx.o
FAILED: CMakeFiles/cmTC_d41f3.dir/src.cxx.o 
/usr/bin/g++ -DHAVE_d2d1  -fPIE -o CMakeFiles/cmTC_d41f3.dir/src.cxx.o -c /home/supernova/dev/qt-build/CMakeFiles/CMakeTmp/src.cxx
/home/supernova/dev/qt-build/CMakeFiles/CMakeTmp/src.cxx:1:11: fatal error: d2d1.h: No such file or directory
    1 |  #include <d2d1.h>
      |           ^~~~~~~~
compilation terminated.
ninja: build stopped: subcommand failed.


Source file was:
 #include <d2d1.h>
int main(int, char **)
{
    void *factory = nullptr;
    D2D1_FACTORY_OPTIONS options;
    ZeroMemory(&options, sizeof(D2D1_FACTORY_OPTIONS));
    D2D1CreateFactory(D2D1_FACTORY_TYPE_SINGLE_THREADED, GUID{}, &options, &factory);
    return 0;
}

Performing C++ SOURCE FILE Test HAVE_d2d1_1 failed with the following output:
Change Dir: /home/supernova/dev/qt-build/CMakeFiles/CMakeTmp

Run Build Command(s):/usr/bin/ninja cmTC_2261d && [1/2] Building CXX object CMakeFiles/cmTC_2261d.dir/src.cxx.o
FAILED: CMakeFiles/cmTC_2261d.dir/src.cxx.o 
/usr/bin/g++ -DHAVE_d2d1_1  -fPIE -o CMakeFiles/cmTC_2261d.dir/src.cxx.o -c /home/supernova/dev/qt-build/CMakeFiles/CMakeTmp/src.cxx
/home/supernova/dev/qt-build/CMakeFiles/CMakeTmp/src.cxx:1:11: fatal error: d2d1_1.h: No such file or directory
    1 |  #include <d2d1_1.h>
      |           ^~~~~~~~~~
compilation terminated.
ninja: build stopped: subcommand failed.


Source file was:
 #include <d2d1_1.h>
int main(int, char **)
{
    ID2D1Factory1 *d2dFactory;
    D2D1CreateFactory(D2D1_FACTORY_TYPE_SINGLE_THREADED, &d2dFactory);
    return 0;
}

Performing C++ SOURCE FILE Test HAVE_pointer_32bit failed with the following output:
Change Dir: /home/supernova/dev/qt-build/CMakeFiles/CMakeTmp

Run Build Command(s):/usr/bin/ninja cmTC_373ac && [1/2] Building CXX object CMakeFiles/cmTC_373ac.dir/src.cxx.o
FAILED: CMakeFiles/cmTC_373ac.dir/src.cxx.o 
/usr/bin/g++ -DHAVE_pointer_32bit  -fPIE -o CMakeFiles/cmTC_373ac.dir/src.cxx.o -c /home/supernova/dev/qt-build/CMakeFiles/CMakeTmp/src.cxx
/home/supernova/dev/qt-build/CMakeFiles/CMakeTmp/src.cxx: In function ‘int main(int, char**)’:
/home/supernova/dev/qt-build/CMakeFiles/CMakeTmp/src.cxx:8:30: error: static assertion failed: fail
    8 | static_assert(sizeof(void *) == 4, "fail");
      |               ~~~~~~~~~~~~~~~^~~~
ninja: build stopped: subcommand failed.


Source file was:
 


int main(int argc, char **argv)
{
    (void)argc; (void)argv;
    /* BEGIN TEST: */
static_assert(sizeof(void *) == 4, "fail");
    /* END TEST: */
    return 0;
}

Performing C++ SOURCE FILE Test HAVE_arm_thumb failed with the following output:
Change Dir: /home/supernova/dev/qt-build/CMakeFiles/CMakeTmp

Run Build Command(s):/usr/bin/ninja cmTC_b4639 && [1/2] Building CXX object CMakeFiles/cmTC_b4639.dir/src.cxx.o
FAILED: CMakeFiles/cmTC_b4639.dir/src.cxx.o 
/usr/bin/g++ -DHAVE_arm_thumb  -fPIE -o CMakeFiles/cmTC_b4639.dir/src.cxx.o -c /home/supernova/dev/qt-build/CMakeFiles/CMakeTmp/src.cxx
/home/supernova/dev/qt-build/CMakeFiles/CMakeTmp/src.cxx:16:6: error: #error "fail"
   16 | #    error "fail"
      |      ^~~~~
ninja: build stopped: subcommand failed.


Source file was:
 


int main(int argc, char **argv)
{
    (void)argc; (void)argv;
    /* BEGIN TEST: */
#if defined(thumb2) || defined(__thumb2__)
#    define THUMB_OK
#elif (defined(__thumb) || defined(__thumb__)) && __TARGET_ARCH_THUMB-0 == 4
#    define THUMB_OK
#elif defined(__ARM_ARCH_ISA_THUMB) && __ARM_ARCH_ISA_THUMB == 2
// clang 3.5 and later will set this if the core supports the Thumb-2 ISA.
#    define THUMB_OK
#else
#    error "fail"
#endif
    /* END TEST: */
    return 0;
}

Performing C++ SOURCE FILE Test HAVE_uacpp failed with the following output:
Change Dir: /home/supernova/dev/qt-build/CMakeFiles/CMakeTmp

Run Build Command(s):/usr/bin/ninja cmTC_ef89e && [1/2] Building CXX object CMakeFiles/cmTC_ef89e.dir/src.cxx.o
FAILED: CMakeFiles/cmTC_ef89e.dir/src.cxx.o 
/usr/bin/g++ -DHAVE_uacpp  -fPIE -o CMakeFiles/cmTC_ef89e.dir/src.cxx.o -c /home/supernova/dev/qt-build/CMakeFiles/CMakeTmp/src.cxx
/home/supernova/dev/qt-build/CMakeFiles/CMakeTmp/src.cxx:3:10: fatal error: uaplatformlayer.h: No such file or directory
    3 | #include <uaplatformlayer.h>
      |          ^~~~~~~~~~~~~~~~~~~
compilation terminated.
ninja: build stopped: subcommand failed.


Source file was:
 #include <stdio.h>

#include <uaplatformlayer.h>
#include <uastring.h>
#include <uasession.h>

using namespace UaClientSdk;

int main(int /*argc*/, char ** /*argv*/)
{

    UaPlatformLayer::init();
    UaSession *session = new UaSession;

    UaPlatformLayer::cleanup();
    return 0;
}
Performing C++ SOURCE FILE Test HAVE_ntddmodm failed with the following output:
Change Dir: /home/supernova/dev/qt-build/CMakeFiles/CMakeTmp

Run Build Command(s):/usr/bin/ninja cmTC_2a86c && [1/2] Building CXX object CMakeFiles/cmTC_2a86c.dir/src.cxx.o
FAILED: CMakeFiles/cmTC_2a86c.dir/src.cxx.o 
/usr/bin/g++ -DHAVE_ntddmodm  -fPIE -o CMakeFiles/cmTC_2a86c.dir/src.cxx.o -c /home/supernova/dev/qt-build/CMakeFiles/CMakeTmp/src.cxx
/home/supernova/dev/qt-build/CMakeFiles/CMakeTmp/src.cxx:2:10: fatal error: windows.h: No such file or directory
    2 | #include <windows.h>
      |          ^~~~~~~~~~~
compilation terminated.
ninja: build stopped: subcommand failed.


Source file was:
 
#include <windows.h>
#include <ntddmodm.h>

int main(int argc, char **argv)
{
    (void)argc; (void)argv;
    /* BEGIN TEST: */
GUID guid = GUID_DEVINTERFACE_MODEM;
    /* END TEST: */
    return 0;
}

Performing C++ SOURCE FILE Test HAVE_khr failed with the following output:
Change Dir: /home/supernova/dev/qt-build/CMakeFiles/CMakeTmp

Run Build Command(s):/usr/bin/ninja cmTC_7ccca && [1/2] Building CXX object CMakeFiles/cmTC_7ccca.dir/src.cxx.o
FAILED: CMakeFiles/cmTC_7ccca.dir/src.cxx.o 
/usr/bin/g++ -DHAVE_khr  -fPIE -o CMakeFiles/cmTC_7ccca.dir/src.cxx.o -c /home/supernova/dev/qt-build/CMakeFiles/CMakeTmp/src.cxx
/home/supernova/dev/qt-build/CMakeFiles/CMakeTmp/src.cxx:2:10: fatal error: KHR/khrplatform.h: No such file or directory
    2 | #include <KHR/khrplatform.h>
      |          ^~~~~~~~~~~~~~~~~~~
compilation terminated.
ninja: build stopped: subcommand failed.


Source file was:
 
#include <KHR/khrplatform.h>
int main(void) {
    return 0;
}
Performing C++ SOURCE FILE Test HAVE_winversion failed with the following output:
Change Dir: /home/supernova/dev/qt-build/CMakeFiles/CMakeTmp

Run Build Command(s):/usr/bin/ninja cmTC_7a0bc && [1/2] Building CXX object CMakeFiles/cmTC_7a0bc.dir/src.cxx.o
FAILED: CMakeFiles/cmTC_7a0bc.dir/src.cxx.o 
/usr/bin/g++ -DHAVE_winversion  -fPIE -o CMakeFiles/cmTC_7a0bc.dir/src.cxx.o -c /home/supernova/dev/qt-build/CMakeFiles/CMakeTmp/src.cxx
/home/supernova/dev/qt-build/CMakeFiles/CMakeTmp/src.cxx:3:2: error: #error unsupported Visual Studio version
    3 | #error unsupported Visual Studio version
      |  ^~~~~
ninja: build stopped: subcommand failed.


Source file was:
 
#if !defined(__clang__) && _MSC_FULL_VER < 191426428
#error unsupported Visual Studio version
#endif
int main(void){
    return 0;
}
supernova@supernova-BOHB-WAX9:~/dev/qt-build$ which ld
/usr/bin/ld
supernova@supernova-BOHB-WAX9:~/dev/qt-build$ which ldd
/usr/bin/ldd
supernova@supernova-BOHB-WAX9:~/dev/qt-build$ help ninja
bash: help: no help topics match `ninja'.  Try `help help' or `man -k ninja' or `info ninja'.
supernova@supernova-BOHB-WAX9:~/dev/qt-build$ man -k ninja
ninja (1)            - small build system closest in spirit to Make
supernova@supernova-BOHB-WAX9:~/dev/qt-build$ info ninja

[1]+  Stopped                 info ninja
supernova@supernova-BOHB-WAX9:~/dev/qt-build$ cmake --build . --parallel
ninja: error: loading 'build.ninja': No such file or directory
supernova@supernova-BOHB-WAX9:~/dev/qt-build$ ~/tmp/qt-everywhere-src-6.4.2/configure
+ mkdir -p qtbase
+ cd qtbase
+ exec /home/supernova/tmp/qt-everywhere-src-6.4.2/qtbase/configure -top-level
'/usr/bin/cmake' '-G' 'Ninja' '/home/supernova/tmp/qt-everywhere-src-6.4.2'
Checking dependencies of submodule 'qtbase'
Checking dependencies of submodule 'qtimageformats'
Checking dependencies of submodule 'qtlanguageserver'
Checking dependencies of submodule 'qtshadertools'
Checking dependencies of submodule 'qtsvg'
Checking dependencies of submodule 'qtdeclarative'
Checking dependencies of submodule 'qtquicktimeline'
Checking dependencies of submodule 'qtquick3d'
Checking dependencies of submodule 'qtmultimedia'
Checking dependencies of submodule 'qt3d'
Checking dependencies of submodule 'qt5compat'
Checking dependencies of submodule 'qtactiveqt'
Checking dependencies of submodule 'qtcharts'
Checking dependencies of submodule 'qtcoap'
Checking dependencies of submodule 'qtconnectivity'
Checking dependencies of submodule 'qtdatavis3d'
Checking dependencies of submodule 'qtwebsockets'
Checking dependencies of submodule 'qthttpserver'
Checking dependencies of submodule 'qttools'
Checking dependencies of submodule 'qtdoc'
Checking dependencies of submodule 'qtlottie'
Checking dependencies of submodule 'qtmqtt'
Checking dependencies of submodule 'qtnetworkauth'
Checking dependencies of submodule 'qtopcua'
Checking dependencies of submodule 'qtserialport'
Checking dependencies of submodule 'qtpositioning'
Checking dependencies of submodule 'qtquick3dphysics'
Checking dependencies of submodule 'qtremoteobjects'
Checking dependencies of submodule 'qtscxml'
Checking dependencies of submodule 'qtsensors'
Checking dependencies of submodule 'qtserialbus'
Checking dependencies of submodule 'qtspeech'
Checking dependencies of submodule 'qttranslations'
Checking dependencies of submodule 'qtvirtualkeyboard'
Checking dependencies of submodule 'qtwayland'
Checking dependencies of submodule 'qtwebchannel'
Checking dependencies of submodule 'qtwebengine'
Checking dependencies of submodule 'qtwebview'
Configuring submodule 'qtbase'
    'qtwebengine_build' is changed from OFF to ON
    'qtpdf_build' is changed from OFF to ON
    'qtwebengine_core_build' is changed from OFF to ON
    'qtwebengine_widgets_build' is changed from OFF to ON
    'qtwebengine_quick_build' is changed from OFF to ON
    'qtpdf_widgets_build' is changed from OFF to ON
    'qtpdf_quick_build' is changed from OFF to ON
CMake Warning at qtbase/cmake/QtSetup.cmake:325 (message):
  Re-configuring in existing build folder.  Some features will be
  re-evaluated automatically.
Call Stack (most recent call first):
  qtbase/cmake/QtBuildInternals/QtBuildInternalsConfig.cmake:237 (include)
  qtbase/cmake/QtBuildInternals/QtBuildInternalsConfig.cmake:382 (qt_build_internals_set_up_private_api)
  qtbase/CMakeLists.txt:109 (qt_build_repo_begin)


-- Could NOT find md4c (missing: md4c_DIR)
CMake Warning (dev) at qtbase/cmake/3rdparty/extra-cmake-modules/find-modules/FindXCB.cmake:180 (message):
  XINPUT from XCB was requested: this is EXPERIMENTAL and is likely to
  unavailable on many systems!
Call Stack (most recent call first):
  qtbase/cmake/QtFindPackageHelpers.cmake:130 (find_package)
  qtbase/src/gui/configure.cmake:123 (qt_find_package)
  qtbase/cmake/QtFeature.cmake:573 (include)
  qtbase/src/CMakeLists.txt:12 (qt_feature_evaluate_features)
This warning is for project developers.  Use -Wno-dev to suppress it.

-- Could NOT find md4c (missing: md4c_DIR)
CMake Warning (dev) at qtbase/cmake/3rdparty/extra-cmake-modules/find-modules/FindXCB.cmake:180 (message):
  XINPUT from XCB was requested: this is EXPERIMENTAL and is likely to
  unavailable on many systems!
Call Stack (most recent call first):
  qtbase/cmake/QtFindPackageHelpers.cmake:130 (find_package)
  qtbase/src/gui/configure.cmake:123 (qt_find_package)
  qtbase/cmake/QtModuleHelpers.cmake:612 (include)
  qtbase/src/gui/CMakeLists.txt:53 (qt_internal_add_module)
This warning is for project developers.  Use -Wno-dev to suppress it.

Configuring submodule 'qtimageformats'
Configuring submodule 'qtlanguageserver'
Configuring submodule 'qtshadertools'
Configuring submodule 'qtsvg'
Configuring submodule 'qtdeclarative'
Configuring submodule 'qtquicktimeline'
Configuring submodule 'qtquick3d'
Configuring submodule 'qtmultimedia'
Configuring submodule 'qt3d'
Skipping the build as the condition "QT_FEATURE_opengl AND NOT WASM" is not met.
Configuring submodule 'qt5compat'
CMake Warning (dev) at /home/supernova/dev/qt-build/qtbase/lib/cmake/Qt6Qml/Qt6QmlBuildInternals.cmake:410 (message):
  INSTALL_SOURCE_QMLTYPES option is deprecated and should not be used.
  Please port your module to use declarative type registration.
Call Stack (most recent call first):
  qt5compat/src/imports/graphicaleffects5/CMakeLists.txt:33 (qt_internal_add_qml_module)
This warning is for project developers.  Use -Wno-dev to suppress it.

Configuring submodule 'qtactiveqt'
Condition "WIN32" is not met, enabling documentation build only.
Configuring submodule 'qtcharts'
-- Found XKB: /usr/lib/x86_64-linux-gnu/libxkbcommon.so (found suitable version "1.4.0", minimum required is "0.5.0") 
-- Could NOT find Qt6OpenGL (missing: Qt6OpenGL_DIR)
CMake Warning at /home/supernova/dev/qt-build/qtbase/lib/cmake/Qt6/Qt6Config.cmake:214 (message):
  Failed to find optional Qt component "OpenGL".

  Expected Config file at
  "/home/supernova/dev/qt-build/qtbase/lib/cmake/Qt6OpenGL/Qt6OpenGLConfig.cmake"
  does NOT exist

Call Stack (most recent call first):
  qtcharts/CMakeLists.txt:17 (find_package)


-- Could NOT find Qt6OpenGLWidgets (missing: Qt6OpenGLWidgets_DIR)
CMake Warning at /home/supernova/dev/qt-build/qtbase/lib/cmake/Qt6/Qt6Config.cmake:214 (message):
  Failed to find optional Qt component "OpenGLWidgets".

  Expected Config file at
  "/home/supernova/dev/qt-build/qtbase/lib/cmake/Qt6OpenGLWidgets/Qt6OpenGLWidgetsConfig.cmake"
  does NOT exist

Call Stack (most recent call first):
  qtcharts/CMakeLists.txt:17 (find_package)


Configuring submodule 'qtcoap'
Configuring submodule 'qtconnectivity'
Configuring submodule 'qtdatavis3d'
-- Could NOT find Qt6OpenGL (missing: Qt6OpenGL_DIR)
CMake Warning at /home/supernova/dev/qt-build/qtbase/lib/cmake/Qt6/Qt6Config.cmake:214 (message):
  Failed to find optional Qt component "OpenGL".

  Expected Config file at
  "/home/supernova/dev/qt-build/qtbase/lib/cmake/Qt6OpenGL/Qt6OpenGLConfig.cmake"
  does NOT exist

Call Stack (most recent call first):
  qtdatavis3d/CMakeLists.txt:12 (find_package)


Skipping the build as the condition "TARGET Qt::OpenGL" is not met.
Configuring submodule 'qtwebsockets'
CMake Warning (dev) at /home/supernova/dev/qt-build/qtbase/lib/cmake/Qt6Qml/Qt6QmlBuildInternals.cmake:410 (message):
  INSTALL_SOURCE_QMLTYPES option is deprecated and should not be used.
  Please port your module to use declarative type registration.
Call Stack (most recent call first):
  qtwebsockets/src/imports/qmlwebsockets/CMakeLists.txt:1 (qt_internal_add_qml_module)
This warning is for project developers.  Use -Wno-dev to suppress it.

Configuring submodule 'qthttpserver'
Configuring submodule 'qttools'
-- Could NOT find Clang (missing: Clang_DIR)
-- Could NOT find Clang (missing: Clang_DIR)
QtDesigner: WARNING: /home/supernova/tmp/qt-everywhere-src-6.4.2/qttools/src/designer/src/lib/uilib/abstractformbuilder.h includes uilib_global.h when it should include QtDesigner/uilib_global.h
QtDesigner: WARNING: /home/supernova/tmp/qt-everywhere-src-6.4.2/qttools/src/designer/src/lib/uilib/formbuilder.h includes uilib_global.h when it should include QtDesigner/uilib_global.h
QtDesigner: WARNING: /home/supernova/tmp/qt-everywhere-src-6.4.2/qttools/src/designer/src/lib/uilib/formbuilder.h includes abstractformbuilder.h when it should include QtDesigner/abstractformbuilder.h
Configuring submodule 'qtdoc'
Configuring submodule 'qtlottie'
Configuring submodule 'qtmqtt'
Configuring submodule 'qtnetworkauth'
Configuring submodule 'qtopcua'
Configuring submodule 'qtserialport'
Configuring submodule 'qtpositioning'
Configuring submodule 'qtquick3dphysics'
Configuring submodule 'qtremoteobjects'
Configuring submodule 'qtscxml'
-- Could NOT find Qt6OpenGL (missing: Qt6OpenGL_DIR)
CMake Warning at /home/supernova/dev/qt-build/qtbase/lib/cmake/Qt6/Qt6Config.cmake:214 (message):
  Failed to find optional Qt component "OpenGL".

  Expected Config file at
  "/home/supernova/dev/qt-build/qtbase/lib/cmake/Qt6OpenGL/Qt6OpenGLConfig.cmake"
  does NOT exist

Call Stack (most recent call first):
  qtscxml/CMakeLists.txt:12 (find_package)


-- Could NOT find Qt6OpenGLWidgets (missing: Qt6OpenGLWidgets_DIR)
CMake Warning at /home/supernova/dev/qt-build/qtbase/lib/cmake/Qt6/Qt6Config.cmake:214 (message):
  Failed to find optional Qt component "OpenGLWidgets".

  Expected Config file at
  "/home/supernova/dev/qt-build/qtbase/lib/cmake/Qt6OpenGLWidgets/Qt6OpenGLWidgetsConfig.cmake"
  does NOT exist

Call Stack (most recent call first):
  qtscxml/CMakeLists.txt:12 (find_package)


Configuring submodule 'qtsensors'
Configuring submodule 'qtserialbus'
Configuring submodule 'qtspeech'
Configuring submodule 'qttranslations'
CMake Warning at qttranslations/translations/CMakeLists.txt:37 (message):
  Directory
  '/home/supernova/tmp/qt-everywhere-src-6.4.2/qttranslations/translations/../../qtlocation/src'
  for qtlocation does not exist.  Skipping...
Call Stack (most recent call first):
  qttranslations/translations/CMakeLists.txt:105 (add_ts_targets)


CMake Warning at qttranslations/translations/CMakeLists.txt:44 (message):
  No source files located for qtlocation, skipping target creation
Call Stack (most recent call first):
  qttranslations/translations/CMakeLists.txt:105 (add_ts_targets)


Configuring submodule 'qtvirtualkeyboard'
QtVirtualKeyboard: WARNING: /home/supernova/tmp/qt-everywhere-src-6.4.2/qtvirtualkeyboard/src/virtualkeyboard/qvirtualkeyboard_namespace.h does not include QT_BEGIN_NAMESPACE
Configuring submodule 'qtwayland'
CMake Warning at qtwayland/src/CMakeLists.txt:7 (message):
  QtWayland is missing required dependencies, nothing will be built.
  Although this could be considered an error, the configuration will still
  pass as coin (Qt's continuous integration system) will fail the build if
  configure fails, but will still try to configure the module on targets that
  are missing dependencies.


Configuring submodule 'qtwebchannel'
CMake Warning (dev) at /home/supernova/dev/qt-build/qtbase/lib/cmake/Qt6Qml/Qt6QmlBuildInternals.cmake:410 (message):
  INSTALL_SOURCE_QMLTYPES option is deprecated and should not be used.
  Please port your module to use declarative type registration.
Call Stack (most recent call first):
  qtwebchannel/src/imports/webchannel/CMakeLists.txt:7 (qt_internal_add_qml_module)
This warning is for project developers.  Use -Wno-dev to suppress it.

Configuring submodule 'qtwebengine'
Traceback (most recent call last):
  File "<string>", line 1, in <module>
ModuleNotFoundError: No module named 'html5lib'
-- Checking 'ulimit -n'
 -- Open files limit 1024
 -- Creating linker launcher
-- Support check for QtWebEngine failed: node.js version 12 or later is required.
-- Support check for QtPdf failed: node.js version 12 or later is required.
Configuring submodule 'qtwebview'
-- Could NOT find Qt6OpenGL (missing: Qt6OpenGL_DIR)
CMake Warning at /home/supernova/dev/qt-build/qtbase/lib/cmake/Qt6/Qt6Config.cmake:214 (message):
  Failed to find optional Qt component "OpenGL".

  Expected Config file at
  "/home/supernova/dev/qt-build/qtbase/lib/cmake/Qt6OpenGL/Qt6OpenGLConfig.cmake"
  does NOT exist

Call Stack (most recent call first):
  qtwebview/CMakeLists.txt:12 (find_package)


-- Could NOT find Qt6WebEngineCore (missing: Qt6WebEngineCore_DIR)
CMake Warning at /home/supernova/dev/qt-build/qtbase/lib/cmake/Qt6/Qt6Config.cmake:214 (message):
  Failed to find optional Qt component "WebEngineCore".

  Expected Config file at
  "/home/supernova/dev/qt-build/qtbase/lib/cmake/Qt6WebEngineCore/Qt6WebEngineCoreConfig.cmake"
  does NOT exist

Call Stack (most recent call first):
  qtwebview/CMakeLists.txt:12 (find_package)


-- Could NOT find Qt6WebEngineQuick (missing: Qt6WebEngineQuick_DIR)
CMake Warning at /home/supernova/dev/qt-build/qtbase/lib/cmake/Qt6/Qt6Config.cmake:214 (message):
  Failed to find optional Qt component "WebEngineQuick".

  Expected Config file at
  "/home/supernova/dev/qt-build/qtbase/lib/cmake/Qt6WebEngineQuick/Qt6WebEngineQuickConfig.cmake"
  does NOT exist

Call Stack (most recent call first):
  qtwebview/CMakeLists.txt:12 (find_package)

 

-- Configuration summary shown below. It has also been written to /home/supernova/dev/qt-build/config.summary
-- Configure with --log-level=STATUS or higher to increase CMake's message verbosity. The log level does not persist across reconfigurations.
 
-- Configure summary:

Building for: linux-g++ (x86_64, CPU features: mmx sse sse2)
Compiler: gcc 11.4.0
Build options:
  Mode ................................... release
  Optimize release build for size ........ no
  Fully optimize release builds (-O3) .... no
  Building shared libraries .............. yes
  Using C standard ....................... C11
  Using C++ standard ..................... C++17
  Using ccache ........................... no
  Using new DTAGS ........................ yes
  Relocatable ............................ yes
  Using precompiled headers .............. yes
  Using LTCG ............................. no
  Using Intel CET ........................ yes
  Target compiler supports:
    SSE .................................. SSE2 SSE3 SSSE3 SSE4.1 SSE4.2
    AVX .................................. AVX AVX2 VAES
    AVX512 ............................... F ER CD PF DQ BW VL IFMA VBMI AVX512VBMI2
    Other x86 ............................ AES F16C RDRAND SHA
  Sanitizers:
    Addresses ............................ no
    Threads .............................. no
    Memory ............................... no
    Fuzzer (instrumentation only) ........ no
    Undefined ............................ no
  Build parts ............................ libs tools
Qt modules and options:
  Qt Concurrent .......................... yes
  Qt D-Bus ............................... yes
  Qt D-Bus directly linked to libdbus .... no
  Qt Gui ................................. yes
  Qt Network ............................. yes
  Qt PrintSupport ........................ yes
  Qt Sql ................................. yes
  Qt Testlib ............................. yes
  Qt Widgets ............................. yes
  Qt Xml ................................. yes
Support enabled for:
  Using pkg-config ....................... yes
  udev ................................... no
  Using system zlib ...................... no
  Zstandard support ...................... no
  Thread support ......................... yes
Common build options:
  Linker can resolve circular dependencies  yes
Qt Core:
  backtrace .............................. yes
  DoubleConversion ....................... yes
    Using system DoubleConversion ........ no
  GLib ................................... yes
  ICU .................................... no
  Using system libb2 ..................... no
  Built-in copy of the MIME database ..... yes
  cpp/winrt base ......................... no
  Tracing backend ........................ <none>
  Logging backends:
    journald ............................. no
    syslog ............................... no
    slog2 ................................ no
  PCRE2 .................................. yes
    Using system PCRE2 ................... no
  CLONE_PIDFD support in forkfd .......... yes
Qt Sql:
  SQL item models ........................ yes
Qt Network:
  getifaddrs() ........................... yes
  IPv6 ifname ............................ yes
  libproxy ............................... no
  Linux AF_NETLINK ....................... yes
  OpenSSL ................................ no
    Qt directly linked to OpenSSL ........ no
  OpenSSL 1.1 ............................ no
  DTLS ................................... no
  OCSP-stapling .......................... no
  SCTP ................................... no
  Use system proxies ..................... yes
  GSSAPI ................................. no
  Brotli Decompression Support ........... no
  qTopLevelDomain() ...................... yes
    Built-in publicsuffix database ....... yes
    System publicsuffix database ......... yes
Core tools:
  Android deployment tool ................ yes
  macOS deployment tool .................. no
  Windows deployment tool ................ no
  qmake .................................. yes
Qt Gui:
  Accessibility .......................... yes
  FreeType ............................... yes
    Using system FreeType ................ no
  HarfBuzz ............................... yes
    Using system HarfBuzz ................ no
  Fontconfig ............................. no
  Image formats:
    GIF .................................. yes
    ICO .................................. yes
    JPEG ................................. yes
      Using system libjpeg ............... no
    PNG .................................. yes
      Using system libpng ................ no
  Text formats:
    HtmlParser ........................... yes
    CssParser ............................ yes
    OdfWriter ............................ yes
    MarkdownReader ....................... yes
      Using system libmd4c ............... no
    MarkdownWriter ....................... yes
  EGL .................................... no
  OpenVG ................................. no
  OpenGL:
    Desktop OpenGL ....................... no
    OpenGL ES 2.0 ........................ no
    OpenGL ES 3.0 ........................ no
    OpenGL ES 3.1 ........................ no
    OpenGL ES 3.2 ........................ no
  Vulkan ................................. no
  Session Management ..................... yes
Features used by QPA backends:
  evdev .................................. yes
  libinput ............................... no
  HiRes wheel support in libinput ........ no
  INTEGRITY HID .......................... no
  mtdev .................................. no
  tslib .................................. no
  xkbcommon .............................. yes
  X11 specific:
    XLib ................................. yes
    XCB Xlib ............................. yes
    EGL on X11 ........................... no
    xkbcommon-x11 ........................ no
    xcb-sm ............................... no
QPA backends:
  DirectFB ............................... no
  EGLFS .................................. no
  EGLFS details:
    EGLFS OpenWFD ........................ no
    EGLFS i.Mx6 .......................... no
    EGLFS i.Mx6 Wayland .................. no
    EGLFS RCAR ........................... no
    EGLFS EGLDevice ...................... no
    EGLFS GBM ............................ no
    EGLFS VSP2 ........................... no
    EGLFS Mali ........................... no
    EGLFS Raspberry Pi ................... no
    EGLFS X11 ............................ no
  LinuxFB ................................ yes
  VNC .................................... yes
  VK_KHR_display ......................... no
  QNX:
    lgmon ................................ no
    IMF .................................. no
  XCB:
    Using system-provided xcb-xinput ..... no
    GL integrations:
      GLX Plugin ......................... no
        XCB GLX .......................... no
      EGL-X11 Plugin ..................... no
  Windows:
    Direct 2D ............................ no
    Direct 2D 1.1 ........................ no
    DirectWrite .......................... no
    DirectWrite 3 ........................ no
Qt Widgets:
  GTK+ ................................... no
  Styles ................................. Fusion Windows
Qt Testlib:
  Tester for item models ................. yes
Qt PrintSupport:
  CUPS ................................... no
Qt Sql Drivers:
  DB2 (IBM) .............................. no
  InterBase .............................. no
  MySql .................................. no
  OCI (Oracle) ........................... no
  ODBC ................................... no
  PostgreSQL ............................. no
  SQLite ................................. yes
    Using system provided SQLite ......... no
Further Image Formats:
  JasPer ................................. no
  MNG .................................... no
  TIFF ................................... yes
    Using system libtiff ................. no
  WEBP ................................... yes
    Using system libwebp ................. no
Qt QML:
  QML network support .................... yes
  QML debugging and profiling support .... yes
  QML just-in-time compiler .............. yes
  QML XML http request ................... yes
  QML Locale ............................. yes
Qt QML Models:
  QML list model ......................... yes
  QML delegate model ..................... yes
Qt Quick:
  AnimatedImage item ..................... yes
  Canvas item ............................ yes
  Support for Qt Quick Designer .......... yes
  Flipable item .......................... yes
  GridView item .......................... yes
  ListView item .......................... yes
  TableView item ......................... yes
  TreeView item .......................... yes
  Path support ........................... yes
  PathView item .......................... yes
  Positioner items ....................... yes
  Repeater item .......................... yes
  ShaderEffect item ...................... yes
  Sprite item ............................ yes
Qt Quick Templates 2:
  Hover support .......................... yes
  Multi-touch support .................... yes
  Calendar support ....................... yes
Qt Quick Controls 2:
  Styles ................................. Basic Fusion Imagine iOS Material Universal macOS Windows
QtQuick3D:
  Assimp ................................. yes
  System Assimp .......................... no
Qt Multimedia:
  Spatial Audio .......................... yes
  Spatial Audio (Quick3D) ................ yes
  Low level Audio Backend:
    ALSA (experimental) .................. no
    PulseAudio ........................... no
    MMRenderer ........................... no
    CoreAudio ............................ no
    Windows Media SDK .................... no
    Open SLES (Android) .................. no
    Web Assembly ......................... no
  Plugin:
    GStreamer 1.0 ........................ no
    FFmpeg ............................... no
    MMRenderer ........................... no
    AVFoundation ......................... no
    Windows Media Foundation ............. no
  Hardware acceleration and features:
    Video for Linux ...................... yes
    VAAPI support ........................ no
    Linux DMA buffer support ............. no
    VideoToolbox ......................... no
Qt 5 Compatibility Libraries:
  iconv .................................. yes
Qt Charts Types:
  Area Chart ............................. yes
  Line Chart ............................. yes
  Spline Chart ........................... yes
  Scatter Chart .......................... yes
  Bar Chart .............................. yes
  Pie Chart .............................. yes
  Boxplot Chart .......................... yes
  Candlestick Chart ...................... yes
Qt Axis Types:
  DateTime Axis .......................... yes
Qt Bluetooth:
  BlueZ .................................. no
  BlueZ Low Energy ....................... no
  Linux Crypto API ....................... no
  WinRT Bluetooth API .................... no
Qt Tools:
  Qt Assistant ........................... yes
  QDoc ................................... no
  Clang-based lupdate parser ............. no
  Qt Designer ............................ yes
  Qt Distance Field Generator ............ yes
  Qt Linguist ............................ yes
  pixeltool .............................. yes
  qdbus .................................. yes
  Qt Attributions Scanner ................ yes
  qtdiag ................................. yes
  qtplugininfo ........................... yes
Qt Opcua:
  Open62541 .............................. yes
  Unified Automation C++ SDK ............. no
  Support for namespace 0 NodeId names ... yes
  Namespace 0 NodeIds generator .......... no
  Open62541 security support ............. no
  Support for global discovery server .... no
Serial Port:
  ntddmodm ............................... no
Qt Remote Objects:
  High Availability Manager (ham) ........ no
Qt Scxml:
  ECMAScript data model for QtScxml ...... yes
Qt Sensors:
  sensorfw ............................... no
  sensorfw_enabled_with_cmake ............ no
Qt SerialBus:
  Socket CAN ............................. yes
  Socket CAN FD .......................... yes
  SerialPort Support ..................... yes
Qt TextToSpeech:
  Flite .................................. no
  Flite with ALSA ........................ no
  Speech Dispatcher ...................... no
Qt Virtualkeyboard:
  Desktop integration .................... yes
  Built-in layouts ....................... yes
  Key navigation ......................... no
  Retro style as default ................. no
  Sensitive Debug ........................ no
  Cerence ................................ no
    Static Linking ....................... no
    Handwriting .......................... no
      Alphabetic ......................... no
      CJK ................................ no
    XT9 .................................. no
      XT9 Debug .......................... no
      XT9 9-key layouts .................. no
    Bundle resources ..................... no
      Handwriting ........................ no
      XT9 ................................ no
  Hunspell ............................... no
    Using Hunspell copy from 3rdparty/ ... no
  OpenWnn ................................ yes
  MyScript ............................... no
  Language support enabled for:
    Arabic ............................... yes
    Bulgarian ............................ yes
    Czech ................................ yes
    Danish ............................... yes
    German ............................... yes
    Greek ................................ yes
    English GB ........................... yes
    English US ........................... yes
    Spanish .............................. yes
    Spanish Mexico ....................... yes
    Estonian ............................. yes
    Farsi ................................ yes
    Finnish .............................. yes
    French Canada ........................ yes
    French France ........................ yes
    Hebrew ............................... yes
    Hindi ................................ yes
    Croatian ............................. yes
    Hungarian ............................ yes
    Indonesian ........................... yes
    Italian .............................. yes
    Japanese ............................. yes
    Korean ............................... yes
    Malay ................................ yes
    Norwegian ............................ yes
    Dutch ................................ yes
    Polish ............................... yes
    Portuguese Brazil .................... yes
    Portuguese Portugal .................. yes
    Romanian ............................. yes
    Russian .............................. yes
    Slovak ............................... yes
    Slovenian ............................ yes
    Albanian ............................. yes
    Serbian .............................. yes
    Swedish .............................. yes
    Thai ................................. yes
    Turkish .............................. yes
    Ukrainian ............................ yes
    Vietnamese ........................... yes
    Simplified Chinese ................... yes
    Traditional Chinese .................. yes
    HongKong Chinese ..................... no
  Traditional chinese input methods:
    Zhuyin ............................... yes
    Cangjie .............................. yes
WebEngine Repository Build Options:
  Build Ninja ............................ no
  Build Gn ............................... yes
  Jumbo Build ............................ yes
  Developer build ........................ no
  Build QtWebEngine Modules:
    Build QtWebEngineCore ................ no
    Build QtWebEngineWidgets ............. no
    Build QtWebEngineQuick ............... no
  Build QtPdf Modules:
    Build QtPdfWidgets ................... no
    Build QtPdfQuick ..................... no
  Optional system libraries:
    re2 .................................. no
    icu .................................. no
    libwebp, libwebpmux and libwebpdemux . no
    opus ................................. no
    ffmpeg ............................... no
    libvpx ............................... no
    snappy ............................... no
    glib ................................. no
    zlib ................................. no
    minizip .............................. no
    libevent ............................. no
    libxml2 and libxslt .................. no
    lcms2 ................................ no
    png .................................. no
    jpeg ................................. no
    harfbuzz ............................. no
    freetype ............................. no
    libpci ............................... no
 

Note: Hunspell in Qt Virtual Keyboard is not enabled. Spelling correction will not be available.

WARNING: No backend for low level audio found.
WARNING: QDoc will not be compiled, probably because libclang could not be located. This means that you cannot build the Qt documentation.
Either set CMAKE_PREFIX_PATH or LLVM_INSTALL_DIR to the location of your llvm installation.
On Linux systems, you may be able to install libclang by installing the libclang-dev or libclang-devel package, depending on your distribution.
On macOS, you can use Homebrew's llvm package.
You will also need to set the FEATURE_clang CMake variable to ON to re-evaluate this check.
WARNING: Clang-based lupdate parser will not be available. LLVM and Clang C++ libraries have not been found.
You will need to set the FEATURE_clangcpp CMake variable to ON to re-evaluate this check.
WARNING: QtWebEngine won't be built. node.js version 12 or later is required.
WARNING: QtPdf won't be built. node.js version 12 or later is required.

ERROR: The OpenGL functionality tests failed! You might need to modify the OpenGL package search path by setting the OpenGL_DIR CMake variable to the OpenGL library's installation directory.

CMake Error at qtbase/cmake/QtBuildInformation.cmake:181 (message):
  Check the configuration messages for an error that has occurred.
Call Stack (most recent call first):
  qtbase/cmake/QtBuildInformation.cmake:21 (qt_configure_print_summary)
  CMakeLists.txt:111 (qt_print_feature_summary)


-- Configuring incomplete, errors occurred!
See also "/home/supernova/dev/qt-build/CMakeFiles/CMakeOutput.log".
See also "/home/supernova/dev/qt-build/CMakeFiles/CMakeError.log".
CMake Error at /home/supernova/tmp/qt-everywhere-src-6.4.2/qtbase/cmake/QtProcessConfigureArgs.cmake:965 (message):
  CMake exited with code 1.


supernova@supernova-BOHB-WAX9:~/dev/qt-build$ cat /home/supernova/dev/qt-build/CMakeFiles/CMakeError.log
Performing C++ SOURCE FILE Test TEST_use_lld_linker failed with the following output:
Change Dir: /home/supernova/dev/qt-build/CMakeFiles/CMakeTmp

Run Build Command(s):/usr/bin/ninja cmTC_3db9f && [1/2] Building CXX object CMakeFiles/cmTC_3db9f.dir/src.cxx.o
[2/2] Linking CXX executable cmTC_3db9f
FAILED: cmTC_3db9f 
: && /usr/bin/g++  -fuse-ld=lld CMakeFiles/cmTC_3db9f.dir/src.cxx.o -o cmTC_3db9f   && :
collect2: fatal error: cannot find ‘ld’
compilation terminated.
ninja: build stopped: subcommand failed.


Source file was:
int main() { return 0; }
Performing C++ SOURCE FILE Test TEST_gdb_index failed with the following output:
Change Dir: /home/supernova/dev/qt-build/CMakeFiles/CMakeTmp

Run Build Command(s):/usr/bin/ninja cmTC_36f48 && [1/2] Building CXX object CMakeFiles/cmTC_36f48.dir/src.cxx.o
[2/2] Linking CXX executable cmTC_36f48
FAILED: cmTC_36f48 
: && /usr/bin/g++  -Wl,--gdb-index CMakeFiles/cmTC_36f48.dir/src.cxx.o -o cmTC_36f48   && :
/usr/bin/ld: unrecognized option '--gdb-index'
/usr/bin/ld: use the --help option for usage information
collect2: error: ld returned 1 exit status
ninja: build stopped: subcommand failed.


Source file was:
int main() { return 0; }
Performing C++ SOURCE FILE Test HAVE_alloca_malloc_h failed with the following output:
Change Dir: /home/supernova/dev/qt-build/CMakeFiles/CMakeTmp

Run Build Command(s):/usr/bin/ninja cmTC_83990 && [1/2] Building CXX object CMakeFiles/cmTC_83990.dir/src.cxx.o
FAILED: CMakeFiles/cmTC_83990.dir/src.cxx.o 
/usr/bin/g++ -DHAVE_alloca_malloc_h  -fPIE -o CMakeFiles/cmTC_83990.dir/src.cxx.o -c /home/supernova/dev/qt-build/CMakeFiles/CMakeTmp/src.cxx
/home/supernova/dev/qt-build/CMakeFiles/CMakeTmp/src.cxx: In function ‘int main()’:
/home/supernova/dev/qt-build/CMakeFiles/CMakeTmp/src.cxx:6:1: error: ‘alloca’ was not declared in this scope; did you mean ‘valloc’?
    6 | alloca(1);
      | ^~~~~~
      | valloc
ninja: build stopped: subcommand failed.


Source file was:
 #include <malloc.h>

int main(void)
{
    /* BEGIN TEST: */
alloca(1);
    /* END TEST: */
    return 0;
}

Performing C++ SOURCE FILE Test HAVE_pollts failed with the following output:
Change Dir: /home/supernova/dev/qt-build/CMakeFiles/CMakeTmp

Run Build Command(s):/usr/bin/ninja cmTC_2ae6e && [1/2] Building CXX object CMakeFiles/cmTC_2ae6e.dir/src.cxx.o
FAILED: CMakeFiles/cmTC_2ae6e.dir/src.cxx.o 
/usr/bin/g++ -DHAVE_pollts  -fPIE -o CMakeFiles/cmTC_2ae6e.dir/src.cxx.o -c /home/supernova/dev/qt-build/CMakeFiles/CMakeTmp/src.cxx
/home/supernova/dev/qt-build/CMakeFiles/CMakeTmp/src.cxx: In function ‘int main()’:
/home/supernova/dev/qt-build/CMakeFiles/CMakeTmp/src.cxx:11:1: error: ‘pollts’ was not declared in this scope; did you mean ‘pollfd’?
   11 | pollts(&pfd, 1, &ts, &sig);
      | ^~~~~~
      | pollfd
ninja: build stopped: subcommand failed.


Source file was:
 #include <poll.h>
#include <signal.h>
#include <time.h>

int main(void)
{
    /* BEGIN TEST: */
struct pollfd pfd;
struct timespec ts;
sigset_t sig;
pollts(&pfd, 1, &ts, &sig);
    /* END TEST: */
    return 0;
}

Performing C++ SOURCE FILE Test HAVE_cpp_winrt failed with the following output:
Change Dir: /home/supernova/dev/qt-build/CMakeFiles/CMakeTmp

Run Build Command(s):/usr/bin/ninja cmTC_3dda2 && [1/2] Building CXX object CMakeFiles/cmTC_3dda2.dir/src.cxx.o
FAILED: CMakeFiles/cmTC_3dda2.dir/src.cxx.o 
/usr/bin/g++ -DHAVE_cpp_winrt  -fPIE -o CMakeFiles/cmTC_3dda2.dir/src.cxx.o -c /home/supernova/dev/qt-build/CMakeFiles/CMakeTmp/src.cxx
/home/supernova/dev/qt-build/CMakeFiles/CMakeTmp/src.cxx:2:13: fatal error: winrt/base.h: No such file or directory
    2 | #   include <winrt/base.h>
      |             ^~~~~~~~~~~~~~
compilation terminated.
ninja: build stopped: subcommand failed.


Source file was:
 // Including winrt/base.h causes an error in some configurations (Windows 10 SDK + c++20)
#   include <winrt/base.h>

int main(void)
{
    return 0;
}

Performing C++ SOURCE FILE Test HAVE_xlocalescanprint failed with the following output:
Change Dir: /home/supernova/dev/qt-build/CMakeFiles/CMakeTmp

Run Build Command(s):/usr/bin/ninja cmTC_03b96 && [1/2] Building CXX object CMakeFiles/cmTC_03b96.dir/src.cxx.o
FAILED: CMakeFiles/cmTC_03b96.dir/src.cxx.o 
/usr/bin/g++ -DHAVE_xlocalescanprint  -fPIE -o CMakeFiles/cmTC_03b96.dir/src.cxx.o -c /home/supernova/dev/qt-build/CMakeFiles/CMakeTmp/src.cxx
/home/supernova/dev/qt-build/CMakeFiles/CMakeTmp/src.cxx:10:10: error: #include expects "FILENAME" or <FILENAME>
   10 | #include QDSP_P_H
      |          ^~~~~~~~
/home/supernova/dev/qt-build/CMakeFiles/CMakeTmp/src.cxx: In function ‘int main()’:
/home/supernova/dev/qt-build/CMakeFiles/CMakeTmp/src.cxx:18:1: error: ‘locale_t’ was not declared in this scope
   18 | locale_t invalidLocale = NULL;
      | ^~~~~~~~
/home/supernova/dev/qt-build/CMakeFiles/CMakeTmp/src.cxx:21:17: error: ‘argv’ was not declared in this scope
   21 | qDoubleSnprintf(argv[0], 1, invalidLocale, "invalid format", a);
      |                 ^~~~
/home/supernova/dev/qt-build/CMakeFiles/CMakeTmp/src.cxx:21:29: error: ‘invalidLocale’ was not declared in this scope
   21 | qDoubleSnprintf(argv[0], 1, invalidLocale, "invalid format", a);
      |                             ^~~~~~~~~~~~~
/home/supernova/dev/qt-build/CMakeFiles/CMakeTmp/src.cxx:21:1: error: ‘qDoubleSnprintf’ was not declared in this scope
   21 | qDoubleSnprintf(argv[0], 1, invalidLocale, "invalid format", a);
      | ^~~~~~~~~~~~~~~
/home/supernova/dev/qt-build/CMakeFiles/CMakeTmp/src.cxx:22:62: error: ‘argc’ was not declared in this scope
   22 | qDoubleSscanf(argv[0], invalidLocale, "invalid format", &a, &argc);
      |                                                              ^~~~
/home/supernova/dev/qt-build/CMakeFiles/CMakeTmp/src.cxx:22:1: error: ‘qDoubleSscanf’ was not declared in this scope
   22 | qDoubleSscanf(argv[0], invalidLocale, "invalid format", &a, &argc);
      | ^~~~~~~~~~~~~
ninja: build stopped: subcommand failed.


Source file was:
 #define QT_BEGIN_NAMESPACE
#define QT_END_NAMESPACE

#ifdef _MSVC_VER
#define Q_CC_MSVC _MSVC_VER
#endif

#define QT_NO_DOUBLECONVERSION

#include QDSP_P_H

int main(void)
{
    /* BEGIN TEST: */
#ifdef _MSVC_VER
_locale_t invalidLocale = NULL;
#else
locale_t invalidLocale = NULL;
#endif
double a = 3.4;
qDoubleSnprintf(argv[0], 1, invalidLocale, "invalid format", a);
qDoubleSscanf(argv[0], invalidLocale, "invalid format", &a, &argc);
    /* END TEST: */
    return 0;
}

Performing C++ SOURCE FILE Test HAVE_ifr_index failed with the following output:
Change Dir: /home/supernova/dev/qt-build/CMakeFiles/CMakeTmp

Run Build Command(s):/usr/bin/ninja cmTC_07baf && [1/2] Building CXX object CMakeFiles/cmTC_07baf.dir/src.cxx.o
FAILED: CMakeFiles/cmTC_07baf.dir/src.cxx.o 
/usr/bin/g++ -DHAVE_ifr_index  -fPIE -o CMakeFiles/cmTC_07baf.dir/src.cxx.o -c /home/supernova/dev/qt-build/CMakeFiles/CMakeTmp/src.cxx
/home/supernova/dev/qt-build/CMakeFiles/CMakeTmp/src.cxx: In function ‘int main()’:
/home/supernova/dev/qt-build/CMakeFiles/CMakeTmp/src.cxx:7:5: error: ‘struct ifreq’ has no member named ‘ifr_index’
    7 | req.ifr_index = 0;
      |     ^~~~~~~~~
ninja: build stopped: subcommand failed.


Source file was:
 #include <net/if.h>

int main(void)
{
    /* BEGIN TEST: */
struct ifreq req;
req.ifr_index = 0;
    /* END TEST: */
    return 0;
}

Performing C++ SOURCE FILE Test HAVE_sctp failed with the following output:
Change Dir: /home/supernova/dev/qt-build/CMakeFiles/CMakeTmp

Run Build Command(s):/usr/bin/ninja cmTC_8202a && [1/2] Building CXX object CMakeFiles/cmTC_8202a.dir/src.cxx.o
FAILED: CMakeFiles/cmTC_8202a.dir/src.cxx.o 
/usr/bin/g++ -DHAVE_sctp  -fPIE -o CMakeFiles/cmTC_8202a.dir/src.cxx.o -c /home/supernova/dev/qt-build/CMakeFiles/CMakeTmp/src.cxx
/home/supernova/dev/qt-build/CMakeFiles/CMakeTmp/src.cxx:4:10: fatal error: netinet/sctp.h: No such file or directory
    4 | #include <netinet/sctp.h>
      |          ^~~~~~~~~~~~~~~~
compilation terminated.
ninja: build stopped: subcommand failed.


Source file was:
 #include <sys/types.h>
#include <sys/socket.h>
#include <netinet/in.h>
#include <netinet/sctp.h>

int main(void)
{
    /* BEGIN TEST: */
sctp_initmsg sctpInitMsg;
socklen_t sctpInitMsgSize = sizeof(sctpInitMsg);
(void) socket(PF_INET, SOCK_STREAM, IPPROTO_SCTP);
(void) getsockopt(-1, SOL_SCTP, SCTP_INITMSG, &sctpInitMsg, &sctpInitMsgSize);
    /* END TEST: */
    return 0;
}

Performing C++ SOURCE FILE Test HAVE_networklistmanager failed with the following output:
Change Dir: /home/supernova/dev/qt-build/CMakeFiles/CMakeTmp

Run Build Command(s):/usr/bin/ninja cmTC_3642d && [1/2] Building CXX object CMakeFiles/cmTC_3642d.dir/src.cxx.o
FAILED: CMakeFiles/cmTC_3642d.dir/src.cxx.o 
/usr/bin/g++ -DHAVE_networklistmanager  -fPIE -o CMakeFiles/cmTC_3642d.dir/src.cxx.o -c /home/supernova/dev/qt-build/CMakeFiles/CMakeTmp/src.cxx
/home/supernova/dev/qt-build/CMakeFiles/CMakeTmp/src.cxx:1:11: fatal error: netlistmgr.h: No such file or directory
    1 |  #include <netlistmgr.h>
      |           ^~~~~~~~~~~~~~
compilation terminated.
ninja: build stopped: subcommand failed.


Source file was:
 #include <netlistmgr.h>
#include <wrl/client.h>

int main(void)
{
    /* BEGIN TEST: */
using namespace Microsoft::WRL;
ComPtr<INetworkListManager> networkListManager;
ComPtr<IConnectionPoint> connectionPoint;
ComPtr<IConnectionPointContainer> connectionPointContainer;
networkListManager.As(&connectionPointContainer);
connectionPointContainer->FindConnectionPoint(IID_INetworkConnectionEvents, &connectionPoint);
    /* END TEST: */
    return 0;
}

Performing C++ SOURCE FILE Test HAVE_EGL failed with the following output:
Change Dir: /home/supernova/dev/qt-build/CMakeFiles/CMakeTmp

Run Build Command(s):/usr/bin/ninja cmTC_37436 && [1/2] Building CXX object CMakeFiles/cmTC_37436.dir/src.cxx.o
FAILED: CMakeFiles/cmTC_37436.dir/src.cxx.o 
/usr/bin/g++ -DHAVE_EGL  -fPIE -o CMakeFiles/cmTC_37436.dir/src.cxx.o -c /home/supernova/dev/qt-build/CMakeFiles/CMakeTmp/src.cxx
/home/supernova/dev/qt-build/CMakeFiles/CMakeTmp/src.cxx:2:10: fatal error: EGL/egl.h: No such file or directory
    2 | #include <EGL/egl.h>
      |          ^~~~~~~~~~~
compilation terminated.
ninja: build stopped: subcommand failed.


Source file was:

#include <EGL/egl.h>

int main(int, char **) {
    EGLint x = 0; EGLDisplay dpy = 0; EGLContext ctx = 0;
    eglDestroyContext(dpy, ctx);
}
Performing C++ SOURCE FILE Test HAVE_GLESv2 failed with the following output:
Change Dir: /home/supernova/dev/qt-build/CMakeFiles/CMakeTmp

Run Build Command(s):/usr/bin/ninja cmTC_b57e2 && [1/2] Building CXX object CMakeFiles/cmTC_b57e2.dir/src.cxx.o
FAILED: CMakeFiles/cmTC_b57e2.dir/src.cxx.o 
/usr/bin/g++ -DHAVE_GLESv2  -fPIE -o CMakeFiles/cmTC_b57e2.dir/src.cxx.o -c /home/supernova/dev/qt-build/CMakeFiles/CMakeTmp/src.cxx
/home/supernova/dev/qt-build/CMakeFiles/CMakeTmp/src.cxx:6:12: fatal error: GLES2/gl2.h: No such file or directory
    6 | #  include <GLES2/gl2.h>
      |            ^~~~~~~~~~~~~
compilation terminated.
ninja: build stopped: subcommand failed.


Source file was:

#ifdef __APPLE__
#  include <OpenGLES/ES2/gl.h>
#else
#  define GL_GLEXT_PROTOTYPES
#  include <GLES2/gl2.h>
#endif

int main(int, char **) {
    glUniform1f(1, GLfloat(1.0));
    glClear(GL_COLOR_BUFFER_BIT);
}
Performing C++ SOURCE FILE Test HAVE_integrityfb failed with the following output:
Change Dir: /home/supernova/dev/qt-build/CMakeFiles/CMakeTmp

Run Build Command(s):/usr/bin/ninja cmTC_1b94b && [1/2] Building CXX object CMakeFiles/cmTC_1b94b.dir/src.cxx.o
FAILED: CMakeFiles/cmTC_1b94b.dir/src.cxx.o 
/usr/bin/g++ -DHAVE_integrityfb  -fPIE -o CMakeFiles/cmTC_1b94b.dir/src.cxx.o -c /home/supernova/dev/qt-build/CMakeFiles/CMakeTmp/src.cxx
/home/supernova/dev/qt-build/CMakeFiles/CMakeTmp/src.cxx:1:11: fatal error: device/fbdriver.h: No such file or directory
    1 |  #include <device/fbdriver.h>
      |           ^~~~~~~~~~~~~~~~~~~
compilation terminated.
ninja: build stopped: subcommand failed.


Source file was:
 #include <device/fbdriver.h>

int main(void)
{
    /* BEGIN TEST: */
FBDriver *driver = 0;
    /* END TEST: */
    return 0;
}

Performing C++ SOURCE FILE Test HAVE_directwrite failed with the following output:
Change Dir: /home/supernova/dev/qt-build/CMakeFiles/CMakeTmp

Run Build Command(s):/usr/bin/ninja cmTC_5ab35 && [1/2] Building CXX object CMakeFiles/cmTC_5ab35.dir/src.cxx.o
FAILED: CMakeFiles/cmTC_5ab35.dir/src.cxx.o 
/usr/bin/g++ -DHAVE_directwrite  -fPIE -o CMakeFiles/cmTC_5ab35.dir/src.cxx.o -c /home/supernova/dev/qt-build/CMakeFiles/CMakeTmp/src.cxx
/home/supernova/dev/qt-build/CMakeFiles/CMakeTmp/src.cxx:1:11: fatal error: dwrite_2.h: No such file or directory
    1 |  #include <dwrite_2.h>
      |           ^~~~~~~~~~~~
compilation terminated.
ninja: build stopped: subcommand failed.


Source file was:
 #include <dwrite_2.h>
int main(int, char **)
{
    IUnknown *factory = nullptr;
    DWriteCreateFactory(DWRITE_FACTORY_TYPE_SHARED, __uuidof(IDWriteFactory2),
                        &factory);
    return 0;
}

Performing C++ SOURCE FILE Test HAVE_directwrite3 failed with the following output:
Change Dir: /home/supernova/dev/qt-build/CMakeFiles/CMakeTmp

Run Build Command(s):/usr/bin/ninja cmTC_bd135 && [1/2] Building CXX object CMakeFiles/cmTC_bd135.dir/src.cxx.o
FAILED: CMakeFiles/cmTC_bd135.dir/src.cxx.o 
/usr/bin/g++ -DHAVE_directwrite3  -fPIE -o CMakeFiles/cmTC_bd135.dir/src.cxx.o -c /home/supernova/dev/qt-build/CMakeFiles/CMakeTmp/src.cxx
/home/supernova/dev/qt-build/CMakeFiles/CMakeTmp/src.cxx:1:11: fatal error: dwrite_3.h: No such file or directory
    1 |  #include <dwrite_3.h>
      |           ^~~~~~~~~~~~
compilation terminated.
ninja: build stopped: subcommand failed.


Source file was:
 #include <dwrite_3.h>
int main(int, char **)
{
    IUnknown *factory = nullptr;
    DWriteCreateFactory(DWRITE_FACTORY_TYPE_SHARED, __uuidof(IDWriteFactory3),
                        &factory);
    return 0;
}

Performing C++ SOURCE FILE Test HAVE_d2d1 failed with the following output:
Change Dir: /home/supernova/dev/qt-build/CMakeFiles/CMakeTmp

Run Build Command(s):/usr/bin/ninja cmTC_d41f3 && [1/2] Building CXX object CMakeFiles/cmTC_d41f3.dir/src.cxx.o
FAILED: CMakeFiles/cmTC_d41f3.dir/src.cxx.o 
/usr/bin/g++ -DHAVE_d2d1  -fPIE -o CMakeFiles/cmTC_d41f3.dir/src.cxx.o -c /home/supernova/dev/qt-build/CMakeFiles/CMakeTmp/src.cxx
/home/supernova/dev/qt-build/CMakeFiles/CMakeTmp/src.cxx:1:11: fatal error: d2d1.h: No such file or directory
    1 |  #include <d2d1.h>
      |           ^~~~~~~~
compilation terminated.
ninja: build stopped: subcommand failed.


Source file was:
 #include <d2d1.h>
int main(int, char **)
{
    void *factory = nullptr;
    D2D1_FACTORY_OPTIONS options;
    ZeroMemory(&options, sizeof(D2D1_FACTORY_OPTIONS));
    D2D1CreateFactory(D2D1_FACTORY_TYPE_SINGLE_THREADED, GUID{}, &options, &factory);
    return 0;
}

Performing C++ SOURCE FILE Test HAVE_d2d1_1 failed with the following output:
Change Dir: /home/supernova/dev/qt-build/CMakeFiles/CMakeTmp

Run Build Command(s):/usr/bin/ninja cmTC_2261d && [1/2] Building CXX object CMakeFiles/cmTC_2261d.dir/src.cxx.o
FAILED: CMakeFiles/cmTC_2261d.dir/src.cxx.o 
/usr/bin/g++ -DHAVE_d2d1_1  -fPIE -o CMakeFiles/cmTC_2261d.dir/src.cxx.o -c /home/supernova/dev/qt-build/CMakeFiles/CMakeTmp/src.cxx
/home/supernova/dev/qt-build/CMakeFiles/CMakeTmp/src.cxx:1:11: fatal error: d2d1_1.h: No such file or directory
    1 |  #include <d2d1_1.h>
      |           ^~~~~~~~~~
compilation terminated.
ninja: build stopped: subcommand failed.


Source file was:
 #include <d2d1_1.h>
int main(int, char **)
{
    ID2D1Factory1 *d2dFactory;
    D2D1CreateFactory(D2D1_FACTORY_TYPE_SINGLE_THREADED, &d2dFactory);
    return 0;
}

Performing C++ SOURCE FILE Test HAVE_pointer_32bit failed with the following output:
Change Dir: /home/supernova/dev/qt-build/CMakeFiles/CMakeTmp

Run Build Command(s):/usr/bin/ninja cmTC_373ac && [1/2] Building CXX object CMakeFiles/cmTC_373ac.dir/src.cxx.o
FAILED: CMakeFiles/cmTC_373ac.dir/src.cxx.o 
/usr/bin/g++ -DHAVE_pointer_32bit  -fPIE -o CMakeFiles/cmTC_373ac.dir/src.cxx.o -c /home/supernova/dev/qt-build/CMakeFiles/CMakeTmp/src.cxx
/home/supernova/dev/qt-build/CMakeFiles/CMakeTmp/src.cxx: In function ‘int main(int, char**)’:
/home/supernova/dev/qt-build/CMakeFiles/CMakeTmp/src.cxx:8:30: error: static assertion failed: fail
    8 | static_assert(sizeof(void *) == 4, "fail");
      |               ~~~~~~~~~~~~~~~^~~~
ninja: build stopped: subcommand failed.


Source file was:
 


int main(int argc, char **argv)
{
    (void)argc; (void)argv;
    /* BEGIN TEST: */
static_assert(sizeof(void *) == 4, "fail");
    /* END TEST: */
    return 0;
}

Performing C++ SOURCE FILE Test HAVE_arm_thumb failed with the following output:
Change Dir: /home/supernova/dev/qt-build/CMakeFiles/CMakeTmp

Run Build Command(s):/usr/bin/ninja cmTC_b4639 && [1/2] Building CXX object CMakeFiles/cmTC_b4639.dir/src.cxx.o
FAILED: CMakeFiles/cmTC_b4639.dir/src.cxx.o 
/usr/bin/g++ -DHAVE_arm_thumb  -fPIE -o CMakeFiles/cmTC_b4639.dir/src.cxx.o -c /home/supernova/dev/qt-build/CMakeFiles/CMakeTmp/src.cxx
/home/supernova/dev/qt-build/CMakeFiles/CMakeTmp/src.cxx:16:6: error: #error "fail"
   16 | #    error "fail"
      |      ^~~~~
ninja: build stopped: subcommand failed.


Source file was:
 


int main(int argc, char **argv)
{
    (void)argc; (void)argv;
    /* BEGIN TEST: */
#if defined(thumb2) || defined(__thumb2__)
#    define THUMB_OK
#elif (defined(__thumb) || defined(__thumb__)) && __TARGET_ARCH_THUMB-0 == 4
#    define THUMB_OK
#elif defined(__ARM_ARCH_ISA_THUMB) && __ARM_ARCH_ISA_THUMB == 2
// clang 3.5 and later will set this if the core supports the Thumb-2 ISA.
#    define THUMB_OK
#else
#    error "fail"
#endif
    /* END TEST: */
    return 0;
}

Performing C++ SOURCE FILE Test HAVE_uacpp failed with the following output:
Change Dir: /home/supernova/dev/qt-build/CMakeFiles/CMakeTmp

Run Build Command(s):/usr/bin/ninja cmTC_ef89e && [1/2] Building CXX object CMakeFiles/cmTC_ef89e.dir/src.cxx.o
FAILED: CMakeFiles/cmTC_ef89e.dir/src.cxx.o 
/usr/bin/g++ -DHAVE_uacpp  -fPIE -o CMakeFiles/cmTC_ef89e.dir/src.cxx.o -c /home/supernova/dev/qt-build/CMakeFiles/CMakeTmp/src.cxx
/home/supernova/dev/qt-build/CMakeFiles/CMakeTmp/src.cxx:3:10: fatal error: uaplatformlayer.h: No such file or directory
    3 | #include <uaplatformlayer.h>
      |          ^~~~~~~~~~~~~~~~~~~
compilation terminated.
ninja: build stopped: subcommand failed.


Source file was:
 #include <stdio.h>

#include <uaplatformlayer.h>
#include <uastring.h>
#include <uasession.h>

using namespace UaClientSdk;

int main(int /*argc*/, char ** /*argv*/)
{

    UaPlatformLayer::init();
    UaSession *session = new UaSession;

    UaPlatformLayer::cleanup();
    return 0;
}
Performing C++ SOURCE FILE Test HAVE_ntddmodm failed with the following output:
Change Dir: /home/supernova/dev/qt-build/CMakeFiles/CMakeTmp

Run Build Command(s):/usr/bin/ninja cmTC_2a86c && [1/2] Building CXX object CMakeFiles/cmTC_2a86c.dir/src.cxx.o
FAILED: CMakeFiles/cmTC_2a86c.dir/src.cxx.o 
/usr/bin/g++ -DHAVE_ntddmodm  -fPIE -o CMakeFiles/cmTC_2a86c.dir/src.cxx.o -c /home/supernova/dev/qt-build/CMakeFiles/CMakeTmp/src.cxx
/home/supernova/dev/qt-build/CMakeFiles/CMakeTmp/src.cxx:2:10: fatal error: windows.h: No such file or directory
    2 | #include <windows.h>
      |          ^~~~~~~~~~~
compilation terminated.
ninja: build stopped: subcommand failed.


Source file was:
 
#include <windows.h>
#include <ntddmodm.h>

int main(int argc, char **argv)
{
    (void)argc; (void)argv;
    /* BEGIN TEST: */
GUID guid = GUID_DEVINTERFACE_MODEM;
    /* END TEST: */
    return 0;
}

Performing C++ SOURCE FILE Test HAVE_khr failed with the following output:
Change Dir: /home/supernova/dev/qt-build/CMakeFiles/CMakeTmp

Run Build Command(s):/usr/bin/ninja cmTC_7ccca && [1/2] Building CXX object CMakeFiles/cmTC_7ccca.dir/src.cxx.o
FAILED: CMakeFiles/cmTC_7ccca.dir/src.cxx.o 
/usr/bin/g++ -DHAVE_khr  -fPIE -o CMakeFiles/cmTC_7ccca.dir/src.cxx.o -c /home/supernova/dev/qt-build/CMakeFiles/CMakeTmp/src.cxx
/home/supernova/dev/qt-build/CMakeFiles/CMakeTmp/src.cxx:2:10: fatal error: KHR/khrplatform.h: No such file or directory
    2 | #include <KHR/khrplatform.h>
      |          ^~~~~~~~~~~~~~~~~~~
compilation terminated.
ninja: build stopped: subcommand failed.


Source file was:
 
#include <KHR/khrplatform.h>
int main(void) {
    return 0;
}
Performing C++ SOURCE FILE Test HAVE_winversion failed with the following output:
Change Dir: /home/supernova/dev/qt-build/CMakeFiles/CMakeTmp

Run Build Command(s):/usr/bin/ninja cmTC_7a0bc && [1/2] Building CXX object CMakeFiles/cmTC_7a0bc.dir/src.cxx.o
FAILED: CMakeFiles/cmTC_7a0bc.dir/src.cxx.o 
/usr/bin/g++ -DHAVE_winversion  -fPIE -o CMakeFiles/cmTC_7a0bc.dir/src.cxx.o -c /home/supernova/dev/qt-build/CMakeFiles/CMakeTmp/src.cxx
/home/supernova/dev/qt-build/CMakeFiles/CMakeTmp/src.cxx:3:2: error: #error unsupported Visual Studio version
    3 | #error unsupported Visual Studio version
      |  ^~~~~
ninja: build stopped: subcommand failed.


Source file was:
 
#if !defined(__clang__) && _MSC_FULL_VER < 191426428
#error unsupported Visual Studio version
#endif
int main(void){
    return 0;